{"text_format":"3","workbook":"xlsx","n_sheets":16,"sheets":["Read Me","Eingaben (Inputs)","Ergebnisse (Outputs)","1a. Defaults Segment-Ebene","1b. Corrected Inputs Segment","1c. Inputs Segment Summary","1d. Dropdown Lists","1e. Dropdown Values","2. Eingaben Fahrzeug-Ebene","2a. Ladekonzept","2b. Kosten","2c. LCA","2d. Annahmen","2e. Umweltrechner Verkehr","3a. Detailierte Ergebnisse","Annahmen (zur Information)"],"not_rendered":{"charts":12,"defined_names":13,"comments":1},"read":"whole","date_system":"1900"}

{"sheet":"Read Me","index":0,"n_rows":0,"n_cols":0,"rows_kept":0,"hidden":true}

{"sheet":"Eingaben (Inputs)","index":1,"n_rows":372,"n_cols":11,"rows_kept":372,"merged":[[3,3,3,4],[4,3,4,4],[5,3,5,4]]}
[]
[null,null,"Eingabe"]
[]
[{"$nulls":3},"Erforderliches Eingabefeld",null,"Bitte ausfüllen bzw. eine Option wählen."]
[{"$nulls":3},"Optionales Eingabefeld",null,"Ein Standardwert wird angezeigt und kann bei Bedarf angepasst werden."]
[{"$nulls":3},"Berechnetes Feld",null,"Der Wert wird berechnet und kann nicht bearbeitet werden."]
[]
[]
[null,null,"Flottenstruktur"]
[]
[null,null,"Flotte"]
[null,null,"Anzahl Segmente",1,null,"Flottensegmente werden nach verschiedenen Fahrzeugtypen bzw. Fahr- und Nutzungsprofilen charakterisiert. Es sind maximal 10 Segmente definierbar (A, B, C usw.). Jedes Segment ist unten separat auszufüllen."]
[]
[]
[null,null,"Segment A",{"$nulls":5},"Energiekosten und Ladeinfrastruktur (betrifft sämtliche Segmente bzw. die gesamte Flotte)"]
[]
[null,null,"Segmentstruktur",{"$nulls":5},"Energiekosten"]
[null,null,"Anzahl Fahrzeuge",1,{"$nulls":4},"Durchschnittliche Treibstoffkosten",{"$f":"'1a. Defaults Segment-Ebene'!J18","v":{"v":1.8,"d":"1.80"}},"CHF/l"]
[null,null,"Einsatzart","Poolfahrzeuge",null,"Poolfahrzeuge werden ausschliesslich beruflich genutzt und verbleiben üblicherweise über Nacht am Firmenstandort.\nDienstfahrzeuge werden von einer oder mehreren Personen beruflich und privat genutzt und können typischerweise auch für den Arbeitsweg verwendet werden.",null,null,"Durchschnittliche Stromkosten Wohnort",{"$f":"'1a. Defaults Segment-Ebene'!J19","v":0.24},"CHF/kWh"]
[null,null,"Einsatzgebiet","regional",{"$nulls":4},"Durchschnittliche Stromkosten Firmenstandort",{"$f":"'1a. Defaults Segment-Ebene'!J20","v":0.24},"CHF/kWh"]
[null,null,"Heimlademöglichkeit",{"$f":"'1a. Defaults Segment-Ebene'!D21","v":"Nein"},null,"Angabe, ob Fahrzeuge am Wohnort der Nutzenden geladen werden können. Wirkt sich nur auf Dienstfahrzeuge aus. Poolfahrzeuge werden nie am Wohnort geladen.",null,null,"Durchschnittliche Ladepreise an öffentlichen Ladepunkten",{"$f":"'1a. Defaults Segment-Ebene'!J21","v":0.55},"CHF/kWh"]
[]
[null,null,"Fahrzeugdaten",{"$nulls":5},"Ladeinfrastruktur und Netzanschluss"]
[null,null,"Fahrzeuggrösse","Mittelklasse",{"$nulls":4},"Max. Ladeleistung pro Ladepunkt Wohnort",{"$f":"'1a. Defaults Segment-Ebene'!J24","v":11},"kW"]
[null,null,"Treibstoffverbrauch Verbrenner",{"$f":"'1a. Defaults Segment-Ebene'!D25","v":5.8},"l/100 km",{"$f":"'1a. Defaults Segment-Ebene'!F25","v":"Standardwert: 5.8 l/100 km"},null,null,"Max. Ladeleistung pro Ladepunkt Firmenstandort AC",{"$f":"'1a. Defaults Segment-Ebene'!J25","v":11},"kW"]
[null,null,"Energieverbrauch E-Fahrzeug",{"$f":"'1a. Defaults Segment-Ebene'!D26","v":15.1},"kWh/100 km",{"$f":"'1a. Defaults Segment-Ebene'!F26","v":"Standardwert: 15.1 kWh/100 km"},null,null,"Max. Ladeleistung pro Ladepunkt Firmenstandort DC",{"$f":"'1a. Defaults Segment-Ebene'!J26","v":250},"kW"]
[null,null,"Batteriekapazität (netto)",{"$f":"'1a. Defaults Segment-Ebene'!D27","v":{"v":58.625,"d":"58.6"}},"kWh",{"$f":"\"Effektiv nutzbare Speicherkapazität, berechnet aus Bruttokapazität abzüglich herstellerseitiger Sicherheits- und Gesundheitspuffer. I.d.R. ca. 90-95% der Bruttokapazität. \"&'1a. Defaults Segment-Ebene'!F27","v":"Effektiv nutzbare Speicherkapazität, berechnet aus Bruttokapazität abzüglich herstellerseitiger Sicherheits- und Gesundheitspuffer. I.d.R. ca. 90-95% der Bruttokapazität. Standardwert: 58.6 kWh"},null,null,"Anschlussleistung Firmenstandort (heute frei verfügbar)",{"$f":"'1a. Defaults Segment-Ebene'!J27","v":40},"kVA"]
[{"$nulls":8},"Fahrzeuge pro Ladepunkt Wohnort (über Nacht)",{"$f":"'1a. Defaults Segment-Ebene'!J28","v":1}]
[null,null,"Fahr- und Nutzungsprofil (Angabe pro Fahrzeug)",{"$nulls":5},"Fahrzeuge pro Ladepunkt Firmenstandort (über Nacht)",{"$f":"'1a. Defaults Segment-Ebene'!J29","v":1}]
[null,null,"Nutzungsmuster","Werktagsbetrieb",null,"Das Nutzungsmuster beschreibt, wie intensiv die Fahrzeuge während der Arbeitszeit eingesetzt werden. Entsprechend werden unten verschiedene Standardwerte angepasst. Die private Nutzung der Dienstfahrzeuge wird im Werkzeug nicht berücksichtigt."]
[null,null,"Anzahl Arbeitstage pro Jahr",{"$f":"'1a. Defaults Segment-Ebene'!D31","v":260},null,{"$f":"'1a. Defaults Segment-Ebene'!F31","v":"Standardwert: 260"}]
[null,null,"Fahrdistanz während der Arbeitszeit",{"$f":"'1a. Defaults Segment-Ebene'!D32","v":100},"km/Tag",{"$f":"\"Durchschnittliche Fahrdistanz pro Fahrzeug an einem typischen Arbeitstag exkl. Pendlerdistanz. \"&'1a. Defaults Segment-Ebene'!F32","v":"Durchschnittliche Fahrdistanz pro Fahrzeug an einem typischen Arbeitstag exkl. Pendlerdistanz. Standardwert: 100 km/Tag"}]
[null,null,"Pendeldistanz (Hin- und Rückfahrt)",{"$f":"'1a. Defaults Segment-Ebene'!D33","v":0},"km/Tag",{"$f":"\"Pendlerdistanz pro Fahrzeug an einem typischen Arbeitstag. \"&'1a. Defaults Segment-Ebene'!F33","v":"Pendlerdistanz pro Fahrzeug an einem typischen Arbeitstag. Standardwert: 0 km/Tag"}]
[null,null,"Anzahl Einsätze pro Tag",{"$f":"'1a. Defaults Segment-Ebene'!D34","v":1},null,{"$f":"\"Alle Einsätze an einem typischen Arbeitstag. Ein Einsatz wird definiert als Fahrt ab Firmenstandort bis und mit Rückkehr zurück an den Firmenstandort. \"&'1a. Defaults Segment-Ebene'!F34","v":"Alle Einsätze an einem typischen Arbeitstag. Ein Einsatz wird definiert als Fahrt ab Firmenstandort bis und mit Rückkehr zurück an den Firmenstandort. Standardwert: 1"}]
[null,null,"Anzahl Pausen pro Tag",{"$f":"D34","v":1}]
[null,null,"Standzeit pro Pause am Firmenstandort",{"$f":"'1a. Defaults Segment-Ebene'!D36","v":1},"Stunden",{"$f":"'1a. Defaults Segment-Ebene'!F36","v":"Standardwert: 1 Stunde"}]
[null,null,"Standzeit über Nacht",{"$f":"'1a. Defaults Segment-Ebene'!D37","v":8},"Stunden",{"$f":"\"Verfügbare Ladezeit am Wohnort oder Firmenstandort über Nacht. \"&'1a. Defaults Segment-Ebene'!F37","v":"Verfügbare Ladezeit am Wohnort oder Firmenstandort über Nacht. Standardwert: 8 Stunden"}]
[null,null,"Fahrzeuge pro Ladepunkt, Firmenstandort (tagsüber)",{"$f":"'1a. Defaults Segment-Ebene'!D38","v":1},null,{"$f":"\"Typischerweise kann bei Schichtbetrieb ein Ladepunkt am Firmenstandort für mehrere Fahrzeuge verwendet werden. \"&'1a. Defaults Segment-Ebene'!F38","v":"Typischerweise kann bei Schichtbetrieb ein Ladepunkt am Firmenstandort für mehrere Fahrzeuge verwendet werden. Standardwert: 1"}]
[]
[null,null,"Kosten (Angabe pro Fahrzeug)"]
[null,null,"Laufzeit",48,"Monate"]
[null,null,"Leasing-Zinssatz",{"$f":"'1a. Defaults Segment-Ebene'!D42","v":{"v":0.03,"d":"3.0%"}},null,{"$f":"'1a. Defaults Segment-Ebene'!F42","v":"Standardwert: 3.0%"}]
[null,null,"Anschaffungspreis inkl. Flottenrabatt Verbrenner",{"$f":"'1a. Defaults Segment-Ebene'!D43","v":{"v":27219.464999999997,"d":"27,219"}},"CHF",{"$f":"'1a. Defaults Segment-Ebene'!F43","v":"Standardwert: 27’219 CHF"}]
[null,null,"Service- und Reparaturkosten Verbrenner",{"$f":"'1a. Defaults Segment-Ebene'!D44","v":{"v":0.05,"d":"0.050"}},"CHF/km",{"$f":"'1a. Defaults Segment-Ebene'!F44","v":"Standardwert: 0.050 CHF/km"}]
[null,null,"Restwert Verbrenner",{"$f":"'1a. Defaults Segment-Ebene'!D45","v":{"v":0.31606388888888887,"d":"31.6%"}},null,{"$f":"\"Angestrebter Restwert beim Verkauf/Rückgabe des Fahrzeugs in % der Anschaffungskosten. \"&'1a. Defaults Segment-Ebene'!F45","v":"Angestrebter Restwert beim Verkauf/Rückgabe des Fahrzeugs in % der Anschaffungskosten. Standardwert: 31.6%"}]
[null,null,"Anschaffungspreis inkl. Flottenrabatt E-Fahrzeug",{"$f":"'1a. Defaults Segment-Ebene'!D46","v":{"v":28810.890000000003,"d":"28,811"}},"CHF",{"$f":"'1a. Defaults Segment-Ebene'!F46","v":"Standardwert: 28’811 CHF"}]
[null,null,"Service- und Reparaturkosten E-Fahrzeug",{"$f":"'1a. Defaults Segment-Ebene'!D47","v":0.025},"CHF/km",{"$f":"'1a. Defaults Segment-Ebene'!F47","v":"Standardwert: 0.025 CHF/km"}]
[null,null,"Restwert E-Fahrzeug",{"$f":"'1a. Defaults Segment-Ebene'!D48","v":{"v":0.30658197222222217,"d":"30.7%"}},null,{"$f":"\"Angestrebter Restwert beim Verkauf/Rückgabe des Fahrzeugs in % der Anschaffungskosten. \"&'1a. Defaults Segment-Ebene'!F48","v":"Angestrebter Restwert beim Verkauf/Rückgabe des Fahrzeugs in % der Anschaffungskosten. Standardwert: 30.7%"}]
[]
[]
[null,null,"Segment B"]
[]
[null,null,{"$f":"IF(C17<>\"\",C17,\"\")","v":"Segmentstruktur"},null,{"$f":"IF(E17<>\"\",E17,\"\")","v":""}]
[null,null,"Anzahl Fahrzeuge",1,""]
[null,null,"Einsatzart","Poolfahrzeuge","","Poolfahrzeuge werden ausschliesslich beruflich genutzt und verbleiben üblicherweise über Nacht am Firmenstandort.\nDienstfahrzeuge werden von einer oder mehreren Personen beruflich und privat genutzt und können typischerweise auch für den Arbeitsweg verwendet werden."]
[null,null,"Einsatzgebiet","regional",""]
[null,null,"Heimlademöglichkeit",{"$f":"'1a. Defaults Segment-Ebene'!D57","v":"Nein"},"","Angabe, ob Fahrzeuge am Wohnort der Nutzenden geladen werden können. Wirkt sich nur auf Dienstfahrzeuge aus. Poolfahrzeuge werden nie am Wohnort geladen."]
[null,null,"",null,""]
[null,null,"Fahrzeugdaten",null,""]
[null,null,"Fahrzeuggrösse","Mittelklasse",""]
[null,null,"Treibstoffverbrauch Verbrenner",{"$f":"'1a. Defaults Segment-Ebene'!D61","v":5.8},"l/100 km",{"$f":"'1a. Defaults Segment-Ebene'!F61","v":"Standardwert: 5.8 l/100 km"}]
[null,null,"Energieverbrauch E-Fahrzeug",{"$f":"'1a. Defaults Segment-Ebene'!D62","v":15.1},"kWh/100 km",{"$f":"'1a. Defaults Segment-Ebene'!F62","v":"Standardwert: 15.1 kWh/100 km"}]
[null,null,"Batteriekapazität (netto)",{"$f":"'1a. Defaults Segment-Ebene'!D63","v":58.625},"kWh",{"$f":"\"Effektiv nutzbare Speicherkapazität, berechnet aus Bruttokapazität abzüglich herstellerseitiger Sicherheits- und Gesundheitspuffer. I.d.R. ca. 90-95% der Bruttokapazität. \"&'1a. Defaults Segment-Ebene'!F63","v":"Effektiv nutzbare Speicherkapazität, berechnet aus Bruttokapazität abzüglich herstellerseitiger Sicherheits- und Gesundheitspuffer. I.d.R. ca. 90-95% der Bruttokapazität. Standardwert: 58.6 kWh"}]
[null,null,"",null,""]
[null,null,"Fahr- und Nutzungsprofil (Angabe pro Fahrzeug)",null,""]
[null,null,"Nutzungsmuster","Werktagsbetrieb","","Das Nutzungsmuster beschreibt, wie intensiv die Fahrzeuge während der Arbeitszeit eingesetzt werden. Entsprechend werden unten verschiedene Standardwerte angepasst. Die private Nutzung der Dienstfahrzeuge wird im Werkzeug nicht berücksichtigt."]
[null,null,"Anzahl Arbeitstage pro Jahr",{"$f":"'1a. Defaults Segment-Ebene'!D67","v":260},"",{"$f":"'1a. Defaults Segment-Ebene'!F67","v":"Standardwert: 260"}]
[null,null,"Fahrdistanz während der Arbeitszeit",{"$f":"'1a. Defaults Segment-Ebene'!D68","v":100},"km/Tag",{"$f":"\"Durchschnittliche Fahrdistanz pro Fahrzeug an einem typischen Arbeitstag exkl. Pendlerdistanz. \"&'1a. Defaults Segment-Ebene'!F68","v":"Durchschnittliche Fahrdistanz pro Fahrzeug an einem typischen Arbeitstag exkl. Pendlerdistanz. Standardwert: 100 km/Tag"}]
[null,null,"Pendeldistanz (Hin- und Rückfahrt)",{"$f":"'1a. Defaults Segment-Ebene'!D69","v":0},"km/Tag",{"$f":"\"Pendlerdistanz pro Fahrzeug an einem typischen Arbeitstag. \"&'1a. Defaults Segment-Ebene'!F69","v":"Pendlerdistanz pro Fahrzeug an einem typischen Arbeitstag. Standardwert: 0 km/Tag"}]
[null,null,"Anzahl Einsätze pro Tag",{"$f":"'1a. Defaults Segment-Ebene'!D70","v":1},"",{"$f":"\"Alle Einsätze an einem typischen Arbeitstag. Ein Einsatz wird definiert als Fahrt ab Firmenstandort bis und mit Rückkehr zurück an den Firmenstandort. \"&'1a. Defaults Segment-Ebene'!F70","v":"Alle Einsätze an einem typischen Arbeitstag. Ein Einsatz wird definiert als Fahrt ab Firmenstandort bis und mit Rückkehr zurück an den Firmenstandort. Standardwert: 1"}]
[null,null,"Anzahl Pausen pro Tag",{"$f":"D70","v":1},""]
[null,null,"Standzeit pro Pause am Firmenstandort",{"$f":"'1a. Defaults Segment-Ebene'!D72","v":1},"Stunden",{"$f":"'1a. Defaults Segment-Ebene'!F72","v":"Standardwert: 1 Stunde"}]
[null,null,"Standzeit über Nacht",{"$f":"'1a. Defaults Segment-Ebene'!D73","v":8},"Stunden",{"$f":"\"Verfügbare Ladezeit am Wohnort oder Firmenstandort über Nacht. \"&'1a. Defaults Segment-Ebene'!F73","v":"Verfügbare Ladezeit am Wohnort oder Firmenstandort über Nacht. Standardwert: 8 Stunden"}]
[null,null,"Fahrzeuge pro Ladepunkt, Firmenstandort (tagsüber)",{"$f":"'1a. Defaults Segment-Ebene'!D74","v":1},"",{"$f":"\"Typischerweise kann bei Schichtbetrieb ein Ladepunkt am Firmenstandort für mehrere Fahrzeuge verwendet werden. \"&'1a. Defaults Segment-Ebene'!F74","v":"Typischerweise kann bei Schichtbetrieb ein Ladepunkt am Firmenstandort für mehrere Fahrzeuge verwendet werden. Standardwert: 1"}]
[null,null,"",null,""]
[null,null,"Kosten (Angabe pro Fahrzeug)",null,""]
[null,null,"Laufzeit",48,"Monate"]
[null,null,"Leasing-Zinssatz",{"$f":"'1a. Defaults Segment-Ebene'!D78","v":{"v":0.03,"d":"3.0%"}},"",{"$f":"'1a. Defaults Segment-Ebene'!F78","v":"Standardwert: 3.0%"}]
[null,null,"Anschaffungspreis inkl. Flottenrabatt Verbrenner",{"$f":"'1a. Defaults Segment-Ebene'!D79","v":{"v":27219.464999999997,"d":"27,219"}},"CHF",{"$f":"'1a. Defaults Segment-Ebene'!F79","v":"Standardwert: 27’219 CHF"}]
[null,null,"Service- und Reparaturkosten Verbrenner",{"$f":"'1a. Defaults Segment-Ebene'!D80","v":{"v":0.05,"d":"0.050"}},"CHF/km",{"$f":"'1a. Defaults Segment-Ebene'!F80","v":"Standardwert: 0.050 CHF/km"}]
[null,null,"Restwert Verbrenner",{"$f":"'1a. Defaults Segment-Ebene'!D81","v":{"v":0.31606388888888887,"d":"31.6%"}},"",{"$f":"\"Angestrebter Restwert beim Verkauf/Rückgabe des Fahrzeugs in % der Anschaffungskosten. \"&'1a. Defaults Segment-Ebene'!F81","v":"Angestrebter Restwert beim Verkauf/Rückgabe des Fahrzeugs in % der Anschaffungskosten. Standardwert: 31.6%"}]
[null,null,"Anschaffungspreis inkl. Flottenrabatt E-Fahrzeug",{"$f":"'1a. Defaults Segment-Ebene'!D82","v":{"v":28810.890000000003,"d":"28,811"}},"CHF",{"$f":"'1a. Defaults Segment-Ebene'!F82","v":"Standardwert: 28’811 CHF"}]
[null,null,"Service- und Reparaturkosten E-Fahrzeug",{"$f":"'1a. Defaults Segment-Ebene'!D83","v":0.025},"CHF/km",{"$f":"'1a. Defaults Segment-Ebene'!F83","v":"Standardwert: 0.025 CHF/km"}]
[null,null,"Restwert E-Fahrzeug",{"$f":"'1a. Defaults Segment-Ebene'!D84","v":{"v":0.30658197222222217,"d":"30.7%"}},"",{"$f":"\"Angestrebter Restwert beim Verkauf/Rückgabe des Fahrzeugs in % der Anschaffungskosten. \"&'1a. Defaults Segment-Ebene'!F84","v":"Angestrebter Restwert beim Verkauf/Rückgabe des Fahrzeugs in % der Anschaffungskosten. Standardwert: 30.7%"}]
[]
[]
[null,null,"Segment C"]
[]
[null,null,{"$f":"IF(C53<>\"\",C53,\"\")","v":"Segmentstruktur"},null,{"$f":"IF(E53<>\"\",E53,\"\")","v":""}]
[null,null,"Anzahl Fahrzeuge",1,""]
[null,null,"Einsatzart","Poolfahrzeuge","","Poolfahrzeuge werden ausschliesslich beruflich genutzt und verbleiben üblicherweise über Nacht am Firmenstandort.\nDienstfahrzeuge werden von einer oder mehreren Personen beruflich und privat genutzt und können typischerweise auch für den Arbeitsweg verwendet werden."]
[null,null,"Einsatzgebiet","regional",""]
[null,null,"Heimlademöglichkeit",{"$f":"'1a. Defaults Segment-Ebene'!D93","v":"Nein"},"","Angabe, ob Fahrzeuge am Wohnort der Nutzenden geladen werden können. Wirkt sich nur auf Dienstfahrzeuge aus. Poolfahrzeuge werden nie am Wohnort geladen."]
[null,null,"",null,""]
[null,null,"Fahrzeugdaten",null,""]
[null,null,"Fahrzeuggrösse","Mittelklasse",""]
[null,null,"Treibstoffverbrauch Verbrenner",{"$f":"'1a. Defaults Segment-Ebene'!D97","v":5.8},"l/100 km",{"$f":"'1a. Defaults Segment-Ebene'!F97","v":"Standardwert: 5.8 l/100 km"}]
[null,null,"Energieverbrauch E-Fahrzeug",{"$f":"'1a. Defaults Segment-Ebene'!D98","v":15.1},"kWh/100 km",{"$f":"'1a. Defaults Segment-Ebene'!F98","v":"Standardwert: 15.1 kWh/100 km"}]
[null,null,"Batteriekapazität (netto)",{"$f":"'1a. Defaults Segment-Ebene'!D99","v":58.625},"kWh",{"$f":"\"Effektiv nutzbare Speicherkapazität, berechnet aus Bruttokapazität abzüglich herstellerseitiger Sicherheits- und Gesundheitspuffer. I.d.R. ca. 90-95% der Bruttokapazität. \"&'1a. Defaults Segment-Ebene'!F99","v":"Effektiv nutzbare Speicherkapazität, berechnet aus Bruttokapazität abzüglich herstellerseitiger Sicherheits- und Gesundheitspuffer. I.d.R. ca. 90-95% der Bruttokapazität. Standardwert: 58.6 kWh"}]
[null,null,"",null,""]
[null,null,"Fahr- und Nutzungsprofil (Angabe pro Fahrzeug)",null,""]
[null,null,"Nutzungsmuster","Werktagsbetrieb","","Das Nutzungsmuster beschreibt, wie intensiv die Fahrzeuge während der Arbeitszeit eingesetzt werden. Entsprechend werden unten verschiedene Standardwerte angepasst. Die private Nutzung der Dienstfahrzeuge wird im Werkzeug nicht berücksichtigt."]
[null,null,"Anzahl Arbeitstage pro Jahr",{"$f":"'1a. Defaults Segment-Ebene'!D103","v":260},"",{"$f":"'1a. Defaults Segment-Ebene'!F103","v":"Standardwert: 260"}]
[null,null,"Fahrdistanz während der Arbeitszeit",{"$f":"'1a. Defaults Segment-Ebene'!D104","v":100},"km/Tag",{"$f":"\"Durchschnittliche Fahrdistanz pro Fahrzeug an einem typischen Arbeitstag exkl. Pendlerdistanz. \"&'1a. Defaults Segment-Ebene'!F104","v":"Durchschnittliche Fahrdistanz pro Fahrzeug an einem typischen Arbeitstag exkl. Pendlerdistanz. Standardwert: 100 km/Tag"}]
[null,null,"Pendeldistanz (Hin- und Rückfahrt)",{"$f":"'1a. Defaults Segment-Ebene'!D105","v":0},"km/Tag",{"$f":"\"Pendlerdistanz pro Fahrzeug an einem typischen Arbeitstag. \"&'1a. Defaults Segment-Ebene'!F105","v":"Pendlerdistanz pro Fahrzeug an einem typischen Arbeitstag. Standardwert: 0 km/Tag"}]
[null,null,"Anzahl Einsätze pro Tag",{"$f":"'1a. Defaults Segment-Ebene'!D106","v":1},"",{"$f":"\"Alle Einsätze an einem typischen Arbeitstag. Ein Einsatz wird definiert als Fahrt ab Firmenstandort bis und mit Rückkehr zurück an den Firmenstandort. \"&'1a. Defaults Segment-Ebene'!F106","v":"Alle Einsätze an einem typischen Arbeitstag. Ein Einsatz wird definiert als Fahrt ab Firmenstandort bis und mit Rückkehr zurück an den Firmenstandort. Standardwert: 1"}]
[null,null,"Anzahl Pausen pro Tag",{"$f":"D106","v":1},""]
[null,null,"Standzeit pro Pause am Firmenstandort",{"$f":"'1a. Defaults Segment-Ebene'!D108","v":1},"Stunden",{"$f":"'1a. Defaults Segment-Ebene'!F108","v":"Standardwert: 1 Stunde"}]
[null,null,"Standzeit über Nacht",{"$f":"'1a. Defaults Segment-Ebene'!D109","v":8},"Stunden",{"$f":"\"Verfügbare Ladezeit am Wohnort oder Firmenstandort über Nacht. \"&'1a. Defaults Segment-Ebene'!F109","v":"Verfügbare Ladezeit am Wohnort oder Firmenstandort über Nacht. Standardwert: 8 Stunden"}]
[null,null,"Fahrzeuge pro Ladepunkt, Firmenstandort (tagsüber)",{"$f":"'1a. Defaults Segment-Ebene'!D110","v":1},"",{"$f":"\"Typischerweise kann bei Schichtbetrieb ein Ladepunkt am Firmenstandort für mehrere Fahrzeuge verwendet werden. \"&'1a. Defaults Segment-Ebene'!F110","v":"Typischerweise kann bei Schichtbetrieb ein Ladepunkt am Firmenstandort für mehrere Fahrzeuge verwendet werden. Standardwert: 1"}]
[null,null,"",null,""]
[null,null,"Kosten (Angabe pro Fahrzeug)",null,""]
[null,null,"Laufzeit",48,"Monate"]
[null,null,"Leasing-Zinssatz",{"$f":"'1a. Defaults Segment-Ebene'!D114","v":{"v":0.03,"d":"3.0%"}},"",{"$f":"'1a. Defaults Segment-Ebene'!F114","v":"Standardwert: 3.0%"}]
[null,null,"Anschaffungspreis inkl. Flottenrabatt Verbrenner",{"$f":"'1a. Defaults Segment-Ebene'!D115","v":{"v":27219.464999999997,"d":"27,219"}},"CHF",{"$f":"'1a. Defaults Segment-Ebene'!F115","v":"Standardwert: 27’219 CHF"}]
[null,null,"Service- und Reparaturkosten Verbrenner",{"$f":"'1a. Defaults Segment-Ebene'!D116","v":{"v":0.05,"d":"0.050"}},"CHF/km",{"$f":"'1a. Defaults Segment-Ebene'!F116","v":"Standardwert: 0.050 CHF/km"}]
[null,null,"Restwert Verbrenner",{"$f":"'1a. Defaults Segment-Ebene'!D117","v":{"v":0.31606388888888887,"d":"31.6%"}},"",{"$f":"\"Angestrebter Restwert beim Verkauf/Rückgabe des Fahrzeugs in % der Anschaffungskosten. \"&'1a. Defaults Segment-Ebene'!F117","v":"Angestrebter Restwert beim Verkauf/Rückgabe des Fahrzeugs in % der Anschaffungskosten. Standardwert: 31.6%"}]
[null,null,"Anschaffungspreis inkl. Flottenrabatt E-Fahrzeug",{"$f":"'1a. Defaults Segment-Ebene'!D118","v":{"v":28810.890000000003,"d":"28,811"}},"CHF",{"$f":"'1a. Defaults Segment-Ebene'!F118","v":"Standardwert: 28’811 CHF"}]
[null,null,"Service- und Reparaturkosten E-Fahrzeug",{"$f":"'1a. Defaults Segment-Ebene'!D119","v":0.025},"CHF/km",{"$f":"'1a. Defaults Segment-Ebene'!F119","v":"Standardwert: 0.025 CHF/km"}]
[null,null,"Restwert E-Fahrzeug",{"$f":"'1a. Defaults Segment-Ebene'!D120","v":{"v":0.30658197222222217,"d":"30.7%"}},"",{"$f":"\"Angestrebter Restwert beim Verkauf/Rückgabe des Fahrzeugs in % der Anschaffungskosten. \"&'1a. Defaults Segment-Ebene'!F120","v":"Angestrebter Restwert beim Verkauf/Rückgabe des Fahrzeugs in % der Anschaffungskosten. Standardwert: 30.7%"}]
[]
[]
[null,null,"Segment D"]
[]
[null,null,{"$f":"IF(C89<>\"\",C89,\"\")","v":"Segmentstruktur"},null,{"$f":"IF(E89<>\"\",E89,\"\")","v":""}]
[null,null,"Anzahl Fahrzeuge",1,""]
[null,null,"Einsatzart","Poolfahrzeuge","","Poolfahrzeuge werden ausschliesslich beruflich genutzt und verbleiben üblicherweise über Nacht am Firmenstandort.\nDienstfahrzeuge werden von einer oder mehreren Personen beruflich und privat genutzt und können typischerweise auch für den Arbeitsweg verwendet werden."]
[null,null,"Einsatzgebiet","regional",""]
[null,null,"Heimlademöglichkeit",{"$f":"'1a. Defaults Segment-Ebene'!D129","v":"Nein"},"","Angabe, ob Fahrzeuge am Wohnort der Nutzenden geladen werden können. Wirkt sich nur auf Dienstfahrzeuge aus. Poolfahrzeuge werden nie am Wohnort geladen."]
[null,null,"",null,""]
[null,null,"Fahrzeugdaten",null,""]
[null,null,"Fahrzeuggrösse","Mittelklasse",""]
[null,null,"Treibstoffverbrauch Verbrenner",{"$f":"'1a. Defaults Segment-Ebene'!D133","v":5.8},"l/100 km",{"$f":"'1a. Defaults Segment-Ebene'!F133","v":"Standardwert: 5.8 l/100 km"}]
[null,null,"Energieverbrauch E-Fahrzeug",{"$f":"'1a. Defaults Segment-Ebene'!D134","v":15.1},"kWh/100 km",{"$f":"'1a. Defaults Segment-Ebene'!F134","v":"Standardwert: 15.1 kWh/100 km"}]
[null,null,"Batteriekapazität (netto)",{"$f":"'1a. Defaults Segment-Ebene'!D135","v":58.625},"kWh",{"$f":"\"Effektiv nutzbare Speicherkapazität, berechnet aus Bruttokapazität abzüglich herstellerseitiger Sicherheits- und Gesundheitspuffer. I.d.R. ca. 90-95% der Bruttokapazität. \"&'1a. Defaults Segment-Ebene'!F135","v":"Effektiv nutzbare Speicherkapazität, berechnet aus Bruttokapazität abzüglich herstellerseitiger Sicherheits- und Gesundheitspuffer. I.d.R. ca. 90-95% der Bruttokapazität. Standardwert: 58.6 kWh"}]
[null,null,"",null,""]
[null,null,"Fahr- und Nutzungsprofil (Angabe pro Fahrzeug)",null,""]
[null,null,"Nutzungsmuster","Werktagsbetrieb","","Das Nutzungsmuster beschreibt, wie intensiv die Fahrzeuge während der Arbeitszeit eingesetzt werden. Entsprechend werden unten verschiedene Standardwerte angepasst. Die private Nutzung der Dienstfahrzeuge wird im Werkzeug nicht berücksichtigt."]
[null,null,"Anzahl Arbeitstage pro Jahr",{"$f":"'1a. Defaults Segment-Ebene'!D139","v":260},"",{"$f":"'1a. Defaults Segment-Ebene'!F139","v":"Standardwert: 260"}]
[null,null,"Fahrdistanz während der Arbeitszeit",{"$f":"'1a. Defaults Segment-Ebene'!D140","v":100},"km/Tag",{"$f":"\"Durchschnittliche Fahrdistanz pro Fahrzeug an einem typischen Arbeitstag exkl. Pendlerdistanz. \"&'1a. Defaults Segment-Ebene'!F140","v":"Durchschnittliche Fahrdistanz pro Fahrzeug an einem typischen Arbeitstag exkl. Pendlerdistanz. Standardwert: 100 km/Tag"}]
[null,null,"Pendeldistanz (Hin- und Rückfahrt)",{"$f":"'1a. Defaults Segment-Ebene'!D141","v":0},"km/Tag",{"$f":"\"Pendlerdistanz pro Fahrzeug an einem typischen Arbeitstag. \"&'1a. Defaults Segment-Ebene'!F141","v":"Pendlerdistanz pro Fahrzeug an einem typischen Arbeitstag. Standardwert: 0 km/Tag"}]
[null,null,"Anzahl Einsätze pro Tag",{"$f":"'1a. Defaults Segment-Ebene'!D142","v":1},"",{"$f":"\"Alle Einsätze an einem typischen Arbeitstag. Ein Einsatz wird definiert als Fahrt ab Firmenstandort bis und mit Rückkehr zurück an den Firmenstandort. \"&'1a. Defaults Segment-Ebene'!F142","v":"Alle Einsätze an einem typischen Arbeitstag. Ein Einsatz wird definiert als Fahrt ab Firmenstandort bis und mit Rückkehr zurück an den Firmenstandort. Standardwert: 1"}]
[null,null,"Anzahl Pausen pro Tag",{"$f":"D142","v":1},""]
[null,null,"Standzeit pro Pause am Firmenstandort",{"$f":"'1a. Defaults Segment-Ebene'!D144","v":1},"Stunden",{"$f":"'1a. Defaults Segment-Ebene'!F144","v":"Standardwert: 1 Stunde"}]
[null,null,"Standzeit über Nacht",{"$f":"'1a. Defaults Segment-Ebene'!D145","v":8},"Stunden",{"$f":"\"Verfügbare Ladezeit am Wohnort oder Firmenstandort über Nacht. \"&'1a. Defaults Segment-Ebene'!F145","v":"Verfügbare Ladezeit am Wohnort oder Firmenstandort über Nacht. Standardwert: 8 Stunden"}]
[null,null,"Fahrzeuge pro Ladepunkt, Firmenstandort (tagsüber)",{"$f":"'1a. Defaults Segment-Ebene'!D146","v":1},"",{"$f":"\"Typischerweise kann bei Schichtbetrieb ein Ladepunkt am Firmenstandort für mehrere Fahrzeuge verwendet werden. \"&'1a. Defaults Segment-Ebene'!F146","v":"Typischerweise kann bei Schichtbetrieb ein Ladepunkt am Firmenstandort für mehrere Fahrzeuge verwendet werden. Standardwert: 1"}]
[null,null,"",null,""]
[null,null,"Kosten (Angabe pro Fahrzeug)",null,""]
[null,null,"Laufzeit",48,"Monate"]
[null,null,"Leasing-Zinssatz",{"$f":"'1a. Defaults Segment-Ebene'!D150","v":{"v":0.03,"d":"3.0%"}},"",{"$f":"'1a. Defaults Segment-Ebene'!F150","v":"Standardwert: 3.0%"}]
[null,null,"Anschaffungspreis inkl. Flottenrabatt Verbrenner",{"$f":"'1a. Defaults Segment-Ebene'!D151","v":{"v":27219.464999999997,"d":"27,219"}},"CHF",{"$f":"'1a. Defaults Segment-Ebene'!F151","v":"Standardwert: 27’219 CHF"}]
[null,null,"Service- und Reparaturkosten Verbrenner",{"$f":"'1a. Defaults Segment-Ebene'!D152","v":{"v":0.05,"d":"0.050"}},"CHF/km",{"$f":"'1a. Defaults Segment-Ebene'!F152","v":"Standardwert: 0.050 CHF/km"}]
[null,null,"Restwert Verbrenner",{"$f":"'1a. Defaults Segment-Ebene'!D153","v":{"v":0.31606388888888887,"d":"31.6%"}},"",{"$f":"\"Angestrebter Restwert beim Verkauf/Rückgabe des Fahrzeugs in % der Anschaffungskosten. \"&'1a. Defaults Segment-Ebene'!F153","v":"Angestrebter Restwert beim Verkauf/Rückgabe des Fahrzeugs in % der Anschaffungskosten. Standardwert: 31.6%"}]
[null,null,"Anschaffungspreis inkl. Flottenrabatt E-Fahrzeug",{"$f":"'1a. Defaults Segment-Ebene'!D154","v":{"v":28810.890000000003,"d":"28,811"}},"CHF",{"$f":"'1a. Defaults Segment-Ebene'!F154","v":"Standardwert: 28’811 CHF"}]
[null,null,"Service- und Reparaturkosten E-Fahrzeug",{"$f":"'1a. Defaults Segment-Ebene'!D155","v":0.025},"CHF/km",{"$f":"'1a. Defaults Segment-Ebene'!F155","v":"Standardwert: 0.025 CHF/km"}]
[null,null,"Restwert E-Fahrzeug",{"$f":"'1a. Defaults Segment-Ebene'!D156","v":{"v":0.30658197222222217,"d":"30.7%"}},"",{"$f":"\"Angestrebter Restwert beim Verkauf/Rückgabe des Fahrzeugs in % der Anschaffungskosten. \"&'1a. Defaults Segment-Ebene'!F156","v":"Angestrebter Restwert beim Verkauf/Rückgabe des Fahrzeugs in % der Anschaffungskosten. Standardwert: 30.7%"}]
[]
[]
[null,null,"Segment E"]
[]
[null,null,{"$f":"IF(C125<>\"\",C125,\"\")","v":"Segmentstruktur"},null,{"$f":"IF(E125<>\"\",E125,\"\")","v":""}]
[null,null,"Anzahl Fahrzeuge",1,""]
[null,null,"Einsatzart","Poolfahrzeuge","","Poolfahrzeuge werden ausschliesslich beruflich genutzt und verbleiben üblicherweise über Nacht am Firmenstandort.\nDienstfahrzeuge werden von einer oder mehreren Personen beruflich und privat genutzt und können typischerweise auch für den Arbeitsweg verwendet werden."]
[null,null,"Einsatzgebiet","regional",""]
[null,null,"Heimlademöglichkeit",{"$f":"'1a. Defaults Segment-Ebene'!D165","v":"Nein"},"","Angabe, ob Fahrzeuge am Wohnort der Nutzenden geladen werden können. Wirkt sich nur auf Dienstfahrzeuge aus. Poolfahrzeuge werden nie am Wohnort geladen."]
[null,null,"",null,""]
[null,null,"Fahrzeugdaten",null,""]
[null,null,"Fahrzeuggrösse","Mittelklasse",""]
[null,null,"Treibstoffverbrauch Verbrenner",{"$f":"'1a. Defaults Segment-Ebene'!D169","v":5.8},"l/100 km",{"$f":"'1a. Defaults Segment-Ebene'!F169","v":"Standardwert: 5.8 l/100 km"}]
[null,null,"Energieverbrauch E-Fahrzeug",{"$f":"'1a. Defaults Segment-Ebene'!D170","v":15.1},"kWh/100 km",{"$f":"'1a. Defaults Segment-Ebene'!F170","v":"Standardwert: 15.1 kWh/100 km"}]
[null,null,"Batteriekapazität (netto)",{"$f":"'1a. Defaults Segment-Ebene'!D171","v":58.625},"kWh",{"$f":"\"Effektiv nutzbare Speicherkapazität, berechnet aus Bruttokapazität abzüglich herstellerseitiger Sicherheits- und Gesundheitspuffer. I.d.R. ca. 90-95% der Bruttokapazität. \"&'1a. Defaults Segment-Ebene'!F171","v":"Effektiv nutzbare Speicherkapazität, berechnet aus Bruttokapazität abzüglich herstellerseitiger Sicherheits- und Gesundheitspuffer. I.d.R. ca. 90-95% der Bruttokapazität. Standardwert: 58.6 kWh"}]
[null,null,"",null,""]
[null,null,"Fahr- und Nutzungsprofil (Angabe pro Fahrzeug)",null,""]
[null,null,"Nutzungsmuster","Werktagsbetrieb","","Das Nutzungsmuster beschreibt, wie intensiv die Fahrzeuge während der Arbeitszeit eingesetzt werden. Entsprechend werden unten verschiedene Standardwerte angepasst. Die private Nutzung der Dienstfahrzeuge wird im Werkzeug nicht berücksichtigt."]
[null,null,"Anzahl Arbeitstage pro Jahr",{"$f":"'1a. Defaults Segment-Ebene'!D175","v":260},"",{"$f":"'1a. Defaults Segment-Ebene'!F175","v":"Standardwert: 260"}]
[null,null,"Fahrdistanz während der Arbeitszeit",{"$f":"'1a. Defaults Segment-Ebene'!D176","v":100},"km/Tag",{"$f":"\"Durchschnittliche Fahrdistanz pro Fahrzeug an einem typischen Arbeitstag exkl. Pendlerdistanz. \"&'1a. Defaults Segment-Ebene'!F176","v":"Durchschnittliche Fahrdistanz pro Fahrzeug an einem typischen Arbeitstag exkl. Pendlerdistanz. Standardwert: 100 km/Tag"}]
[null,null,"Pendeldistanz (Hin- und Rückfahrt)",{"$f":"'1a. Defaults Segment-Ebene'!D177","v":0},"km/Tag",{"$f":"\"Pendlerdistanz pro Fahrzeug an einem typischen Arbeitstag. \"&'1a. Defaults Segment-Ebene'!F177","v":"Pendlerdistanz pro Fahrzeug an einem typischen Arbeitstag. Standardwert: 0 km/Tag"}]
[null,null,"Anzahl Einsätze pro Tag",{"$f":"'1a. Defaults Segment-Ebene'!D178","v":1},"",{"$f":"\"Alle Einsätze an einem typischen Arbeitstag. Ein Einsatz wird definiert als Fahrt ab Firmenstandort bis und mit Rückkehr zurück an den Firmenstandort. \"&'1a. Defaults Segment-Ebene'!F178","v":"Alle Einsätze an einem typischen Arbeitstag. Ein Einsatz wird definiert als Fahrt ab Firmenstandort bis und mit Rückkehr zurück an den Firmenstandort. Standardwert: 1"}]
[null,null,"Anzahl Pausen pro Tag",{"$f":"D178","v":1},""]
[null,null,"Standzeit pro Pause am Firmenstandort",{"$f":"'1a. Defaults Segment-Ebene'!D180","v":1},"Stunden",{"$f":"'1a. Defaults Segment-Ebene'!F180","v":"Standardwert: 1 Stunde"}]
[null,null,"Standzeit über Nacht",{"$f":"'1a. Defaults Segment-Ebene'!D181","v":8},"Stunden",{"$f":"\"Verfügbare Ladezeit am Wohnort oder Firmenstandort über Nacht. \"&'1a. Defaults Segment-Ebene'!F181","v":"Verfügbare Ladezeit am Wohnort oder Firmenstandort über Nacht. Standardwert: 8 Stunden"}]
[null,null,"Fahrzeuge pro Ladepunkt, Firmenstandort (tagsüber)",{"$f":"'1a. Defaults Segment-Ebene'!D182","v":1},"",{"$f":"\"Typischerweise kann bei Schichtbetrieb ein Ladepunkt am Firmenstandort für mehrere Fahrzeuge verwendet werden. \"&'1a. Defaults Segment-Ebene'!F182","v":"Typischerweise kann bei Schichtbetrieb ein Ladepunkt am Firmenstandort für mehrere Fahrzeuge verwendet werden. Standardwert: 1"}]
[null,null,"",null,""]
[null,null,"Kosten (Angabe pro Fahrzeug)",null,""]
[null,null,"Laufzeit",48,"Monate"]
[null,null,"Leasing-Zinssatz",{"$f":"'1a. Defaults Segment-Ebene'!D186","v":{"v":0.03,"d":"3.0%"}},"",{"$f":"'1a. Defaults Segment-Ebene'!F186","v":"Standardwert: 3.0%"}]
[null,null,"Anschaffungspreis inkl. Flottenrabatt Verbrenner",{"$f":"'1a. Defaults Segment-Ebene'!D187","v":{"v":27219.464999999997,"d":"27,219"}},"CHF",{"$f":"'1a. Defaults Segment-Ebene'!F187","v":"Standardwert: 27’219 CHF"}]
[null,null,"Service- und Reparaturkosten Verbrenner",{"$f":"'1a. Defaults Segment-Ebene'!D188","v":{"v":0.05,"d":"0.050"}},"CHF/km",{"$f":"'1a. Defaults Segment-Ebene'!F188","v":"Standardwert: 0.050 CHF/km"}]
[null,null,"Restwert Verbrenner",{"$f":"'1a. Defaults Segment-Ebene'!D189","v":{"v":0.31606388888888887,"d":"31.6%"}},"",{"$f":"\"Angestrebter Restwert beim Verkauf/Rückgabe des Fahrzeugs in % der Anschaffungskosten. \"&'1a. Defaults Segment-Ebene'!F189","v":"Angestrebter Restwert beim Verkauf/Rückgabe des Fahrzeugs in % der Anschaffungskosten. Standardwert: 31.6%"}]
[null,null,"Anschaffungspreis inkl. Flottenrabatt E-Fahrzeug",{"$f":"'1a. Defaults Segment-Ebene'!D190","v":{"v":28810.890000000003,"d":"28,811"}},"CHF",{"$f":"'1a. Defaults Segment-Ebene'!F190","v":"Standardwert: 28’811 CHF"}]
[null,null,"Service- und Reparaturkosten E-Fahrzeug",{"$f":"'1a. Defaults Segment-Ebene'!D191","v":0.025},"CHF/km",{"$f":"'1a. Defaults Segment-Ebene'!F191","v":"Standardwert: 0.025 CHF/km"}]
[null,null,"Restwert E-Fahrzeug",{"$f":"'1a. Defaults Segment-Ebene'!D192","v":{"v":0.30658197222222217,"d":"30.7%"}},"",{"$f":"\"Angestrebter Restwert beim Verkauf/Rückgabe des Fahrzeugs in % der Anschaffungskosten. \"&'1a. Defaults Segment-Ebene'!F192","v":"Angestrebter Restwert beim Verkauf/Rückgabe des Fahrzeugs in % der Anschaffungskosten. Standardwert: 30.7%"}]
[]
[]
[null,null,"Segment F"]
[]
[null,null,{"$f":"IF(C161<>\"\",C161,\"\")","v":"Segmentstruktur"},null,{"$f":"IF(E161<>\"\",E161,\"\")","v":""}]
[null,null,"Anzahl Fahrzeuge",1,""]
[null,null,"Einsatzart","Poolfahrzeuge","","Poolfahrzeuge werden ausschliesslich beruflich genutzt und verbleiben üblicherweise über Nacht am Firmenstandort.\nDienstfahrzeuge werden von einer oder mehreren Personen beruflich und privat genutzt und können typischerweise auch für den Arbeitsweg verwendet werden."]
[null,null,"Einsatzgebiet","regional",""]
[null,null,"Heimlademöglichkeit",{"$f":"'1a. Defaults Segment-Ebene'!D201","v":"Nein"},"","Angabe, ob Fahrzeuge am Wohnort der Nutzenden geladen werden können. Wirkt sich nur auf Dienstfahrzeuge aus. Poolfahrzeuge werden nie am Wohnort geladen."]
[null,null,"",null,""]
[null,null,"Fahrzeugdaten",null,""]
[null,null,"Fahrzeuggrösse","Mittelklasse",""]
[null,null,"Treibstoffverbrauch Verbrenner",{"$f":"'1a. Defaults Segment-Ebene'!D205","v":5.8},"l/100 km",{"$f":"'1a. Defaults Segment-Ebene'!F205","v":"Standardwert: 5.8 l/100 km"}]
[null,null,"Energieverbrauch E-Fahrzeug",{"$f":"'1a. Defaults Segment-Ebene'!D206","v":15.1},"kWh/100 km",{"$f":"'1a. Defaults Segment-Ebene'!F206","v":"Standardwert: 15.1 kWh/100 km"}]
[null,null,"Batteriekapazität (netto)",{"$f":"'1a. Defaults Segment-Ebene'!D207","v":58.625},"kWh",{"$f":"\"Effektiv nutzbare Speicherkapazität, berechnet aus Bruttokapazität abzüglich herstellerseitiger Sicherheits- und Gesundheitspuffer. I.d.R. ca. 90-95% der Bruttokapazität. \"&'1a. Defaults Segment-Ebene'!F207","v":"Effektiv nutzbare Speicherkapazität, berechnet aus Bruttokapazität abzüglich herstellerseitiger Sicherheits- und Gesundheitspuffer. I.d.R. ca. 90-95% der Bruttokapazität. Standardwert: 58.6 kWh"}]
[null,null,"",null,""]
[null,null,"Fahr- und Nutzungsprofil (Angabe pro Fahrzeug)",null,""]
[null,null,"Nutzungsmuster","Werktagsbetrieb","","Das Nutzungsmuster beschreibt, wie intensiv die Fahrzeuge während der Arbeitszeit eingesetzt werden. Entsprechend werden unten verschiedene Standardwerte angepasst. Die private Nutzung der Dienstfahrzeuge wird im Werkzeug nicht berücksichtigt."]
[null,null,"Anzahl Arbeitstage pro Jahr",{"$f":"'1a. Defaults Segment-Ebene'!D211","v":260},"",{"$f":"'1a. Defaults Segment-Ebene'!F211","v":"Standardwert: 260"}]
[null,null,"Fahrdistanz während der Arbeitszeit",{"$f":"'1a. Defaults Segment-Ebene'!D212","v":100},"km/Tag",{"$f":"\"Durchschnittliche Fahrdistanz pro Fahrzeug an einem typischen Arbeitstag exkl. Pendlerdistanz. \"&'1a. Defaults Segment-Ebene'!F212","v":"Durchschnittliche Fahrdistanz pro Fahrzeug an einem typischen Arbeitstag exkl. Pendlerdistanz. Standardwert: 100 km/Tag"}]
[null,null,"Pendeldistanz (Hin- und Rückfahrt)",{"$f":"'1a. Defaults Segment-Ebene'!D213","v":0},"km/Tag",{"$f":"\"Pendlerdistanz pro Fahrzeug an einem typischen Arbeitstag. \"&'1a. Defaults Segment-Ebene'!F213","v":"Pendlerdistanz pro Fahrzeug an einem typischen Arbeitstag. Standardwert: 0 km/Tag"}]
[null,null,"Anzahl Einsätze pro Tag",{"$f":"'1a. Defaults Segment-Ebene'!D214","v":1},"",{"$f":"\"Alle Einsätze an einem typischen Arbeitstag. Ein Einsatz wird definiert als Fahrt ab Firmenstandort bis und mit Rückkehr zurück an den Firmenstandort. \"&'1a. Defaults Segment-Ebene'!F214","v":"Alle Einsätze an einem typischen Arbeitstag. Ein Einsatz wird definiert als Fahrt ab Firmenstandort bis und mit Rückkehr zurück an den Firmenstandort. Standardwert: 1"}]
[null,null,"Anzahl Pausen pro Tag",{"$f":"D214","v":1},""]
[null,null,"Standzeit pro Pause am Firmenstandort",{"$f":"'1a. Defaults Segment-Ebene'!D216","v":1},"Stunden",{"$f":"'1a. Defaults Segment-Ebene'!F216","v":"Standardwert: 1 Stunde"}]
[null,null,"Standzeit über Nacht",{"$f":"'1a. Defaults Segment-Ebene'!D217","v":8},"Stunden",{"$f":"\"Verfügbare Ladezeit am Wohnort oder Firmenstandort über Nacht. \"&'1a. Defaults Segment-Ebene'!F217","v":"Verfügbare Ladezeit am Wohnort oder Firmenstandort über Nacht. Standardwert: 8 Stunden"}]
[null,null,"Fahrzeuge pro Ladepunkt, Firmenstandort (tagsüber)",{"$f":"'1a. Defaults Segment-Ebene'!D218","v":1},"",{"$f":"\"Typischerweise kann bei Schichtbetrieb ein Ladepunkt am Firmenstandort für mehrere Fahrzeuge verwendet werden. \"&'1a. Defaults Segment-Ebene'!F218","v":"Typischerweise kann bei Schichtbetrieb ein Ladepunkt am Firmenstandort für mehrere Fahrzeuge verwendet werden. Standardwert: 1"}]
[null,null,"",null,""]
[null,null,"Kosten (Angabe pro Fahrzeug)",null,""]
[null,null,"Laufzeit",48,"Monate"]
[null,null,"Leasing-Zinssatz",{"$f":"'1a. Defaults Segment-Ebene'!D222","v":{"v":0.03,"d":"3.0%"}},"",{"$f":"'1a. Defaults Segment-Ebene'!F222","v":"Standardwert: 3.0%"}]
[null,null,"Anschaffungspreis inkl. Flottenrabatt Verbrenner",{"$f":"'1a. Defaults Segment-Ebene'!D223","v":{"v":27219.464999999997,"d":"27,219"}},"CHF",{"$f":"'1a. Defaults Segment-Ebene'!F223","v":"Standardwert: 27’219 CHF"}]
[null,null,"Service- und Reparaturkosten Verbrenner",{"$f":"'1a. Defaults Segment-Ebene'!D224","v":{"v":0.05,"d":"0.050"}},"CHF/km",{"$f":"'1a. Defaults Segment-Ebene'!F224","v":"Standardwert: 0.050 CHF/km"}]
[null,null,"Restwert Verbrenner",{"$f":"'1a. Defaults Segment-Ebene'!D225","v":{"v":0.31606388888888887,"d":"31.6%"}},"",{"$f":"\"Angestrebter Restwert beim Verkauf/Rückgabe des Fahrzeugs in % der Anschaffungskosten. \"&'1a. Defaults Segment-Ebene'!F225","v":"Angestrebter Restwert beim Verkauf/Rückgabe des Fahrzeugs in % der Anschaffungskosten. Standardwert: 31.6%"}]
[null,null,"Anschaffungspreis inkl. Flottenrabatt E-Fahrzeug",{"$f":"'1a. Defaults Segment-Ebene'!D226","v":{"v":28810.890000000003,"d":"28,811"}},"CHF",{"$f":"'1a. Defaults Segment-Ebene'!F226","v":"Standardwert: 28’811 CHF"}]
[null,null,"Service- und Reparaturkosten E-Fahrzeug",{"$f":"'1a. Defaults Segment-Ebene'!D227","v":0.025},"CHF/km",{"$f":"'1a. Defaults Segment-Ebene'!F227","v":"Standardwert: 0.025 CHF/km"}]
[null,null,"Restwert E-Fahrzeug",{"$f":"'1a. Defaults Segment-Ebene'!D228","v":{"v":0.30658197222222217,"d":"30.7%"}},"",{"$f":"\"Angestrebter Restwert beim Verkauf/Rückgabe des Fahrzeugs in % der Anschaffungskosten. \"&'1a. Defaults Segment-Ebene'!F228","v":"Angestrebter Restwert beim Verkauf/Rückgabe des Fahrzeugs in % der Anschaffungskosten. Standardwert: 30.7%"}]
[]
[]
[null,null,"Segment G"]
[]
[null,null,{"$f":"IF(C197<>\"\",C197,\"\")","v":"Segmentstruktur"},null,{"$f":"IF(E197<>\"\",E197,\"\")","v":""}]
[null,null,"Anzahl Fahrzeuge",1,""]
[null,null,"Einsatzart","Poolfahrzeuge","","Poolfahrzeuge werden ausschliesslich beruflich genutzt und verbleiben üblicherweise über Nacht am Firmenstandort.\nDienstfahrzeuge werden von einer oder mehreren Personen beruflich und privat genutzt und können typischerweise auch für den Arbeitsweg verwendet werden."]
[null,null,"Einsatzgebiet","regional",""]
[null,null,"Heimlademöglichkeit",{"$f":"'1a. Defaults Segment-Ebene'!D237","v":"Nein"},"","Angabe, ob Fahrzeuge am Wohnort der Nutzenden geladen werden können. Wirkt sich nur auf Dienstfahrzeuge aus. Poolfahrzeuge werden nie am Wohnort geladen."]
[null,null,"",null,""]
[null,null,"Fahrzeugdaten",null,""]
[null,null,"Fahrzeuggrösse","Mittelklasse",""]
[null,null,"Treibstoffverbrauch Verbrenner",{"$f":"'1a. Defaults Segment-Ebene'!D241","v":5.8},"l/100 km",{"$f":"'1a. Defaults Segment-Ebene'!F241","v":"Standardwert: 5.8 l/100 km"}]
[null,null,"Energieverbrauch E-Fahrzeug",{"$f":"'1a. Defaults Segment-Ebene'!D242","v":15.1},"kWh/100 km",{"$f":"'1a. Defaults Segment-Ebene'!F242","v":"Standardwert: 15.1 kWh/100 km"}]
[null,null,"Batteriekapazität (netto)",{"$f":"'1a. Defaults Segment-Ebene'!D243","v":58.625},"kWh",{"$f":"\"Effektiv nutzbare Speicherkapazität, berechnet aus Bruttokapazität abzüglich herstellerseitiger Sicherheits- und Gesundheitspuffer. I.d.R. ca. 90-95% der Bruttokapazität. \"&'1a. Defaults Segment-Ebene'!F243","v":"Effektiv nutzbare Speicherkapazität, berechnet aus Bruttokapazität abzüglich herstellerseitiger Sicherheits- und Gesundheitspuffer. I.d.R. ca. 90-95% der Bruttokapazität. Standardwert: 58.6 kWh"}]
[null,null,"",null,""]
[null,null,"Fahr- und Nutzungsprofil (Angabe pro Fahrzeug)",null,""]
[null,null,"Nutzungsmuster","Werktagsbetrieb","","Das Nutzungsmuster beschreibt, wie intensiv die Fahrzeuge während der Arbeitszeit eingesetzt werden. Entsprechend werden unten verschiedene Standardwerte angepasst. Die private Nutzung der Dienstfahrzeuge wird im Werkzeug nicht berücksichtigt."]
[null,null,"Anzahl Arbeitstage pro Jahr",{"$f":"'1a. Defaults Segment-Ebene'!D247","v":260},"",{"$f":"'1a. Defaults Segment-Ebene'!F247","v":"Standardwert: 260"}]
[null,null,"Fahrdistanz während der Arbeitszeit",{"$f":"'1a. Defaults Segment-Ebene'!D248","v":100},"km/Tag",{"$f":"\"Durchschnittliche Fahrdistanz pro Fahrzeug an einem typischen Arbeitstag exkl. Pendlerdistanz. \"&'1a. Defaults Segment-Ebene'!F248","v":"Durchschnittliche Fahrdistanz pro Fahrzeug an einem typischen Arbeitstag exkl. Pendlerdistanz. Standardwert: 100 km/Tag"}]
[null,null,"Pendeldistanz (Hin- und Rückfahrt)",{"$f":"'1a. Defaults Segment-Ebene'!D249","v":0},"km/Tag",{"$f":"\"Pendlerdistanz pro Fahrzeug an einem typischen Arbeitstag. \"&'1a. Defaults Segment-Ebene'!F249","v":"Pendlerdistanz pro Fahrzeug an einem typischen Arbeitstag. Standardwert: 0 km/Tag"}]
[null,null,"Anzahl Einsätze pro Tag",{"$f":"'1a. Defaults Segment-Ebene'!D250","v":1},"",{"$f":"\"Alle Einsätze an einem typischen Arbeitstag. Ein Einsatz wird definiert als Fahrt ab Firmenstandort bis und mit Rückkehr zurück an den Firmenstandort. \"&'1a. Defaults Segment-Ebene'!F250","v":"Alle Einsätze an einem typischen Arbeitstag. Ein Einsatz wird definiert als Fahrt ab Firmenstandort bis und mit Rückkehr zurück an den Firmenstandort. Standardwert: 1"}]
[null,null,"Anzahl Pausen pro Tag",{"$f":"D250","v":1},""]
[null,null,"Standzeit pro Pause am Firmenstandort",{"$f":"'1a. Defaults Segment-Ebene'!D252","v":1},"Stunden",{"$f":"'1a. Defaults Segment-Ebene'!F252","v":"Standardwert: 1 Stunde"}]
[null,null,"Standzeit über Nacht",{"$f":"'1a. Defaults Segment-Ebene'!D253","v":8},"Stunden",{"$f":"\"Verfügbare Ladezeit am Wohnort oder Firmenstandort über Nacht. \"&'1a. Defaults Segment-Ebene'!F253","v":"Verfügbare Ladezeit am Wohnort oder Firmenstandort über Nacht. Standardwert: 8 Stunden"}]
[null,null,"Fahrzeuge pro Ladepunkt, Firmenstandort (tagsüber)",{"$f":"'1a. Defaults Segment-Ebene'!D254","v":1},"",{"$f":"\"Typischerweise kann bei Schichtbetrieb ein Ladepunkt am Firmenstandort für mehrere Fahrzeuge verwendet werden. \"&'1a. Defaults Segment-Ebene'!F254","v":"Typischerweise kann bei Schichtbetrieb ein Ladepunkt am Firmenstandort für mehrere Fahrzeuge verwendet werden. Standardwert: 1"}]
[null,null,"",null,""]
[null,null,"Kosten (Angabe pro Fahrzeug)",null,""]
[null,null,"Laufzeit",48,"Monate"]
[null,null,"Leasing-Zinssatz",{"$f":"'1a. Defaults Segment-Ebene'!D258","v":{"v":0.03,"d":"3.0%"}},"",{"$f":"'1a. Defaults Segment-Ebene'!F258","v":"Standardwert: 3.0%"}]
[null,null,"Anschaffungspreis inkl. Flottenrabatt Verbrenner",{"$f":"'1a. Defaults Segment-Ebene'!D259","v":{"v":27219.464999999997,"d":"27,219"}},"CHF",{"$f":"'1a. Defaults Segment-Ebene'!F259","v":"Standardwert: 27’219 CHF"}]
[null,null,"Service- und Reparaturkosten Verbrenner",{"$f":"'1a. Defaults Segment-Ebene'!D260","v":{"v":0.05,"d":"0.050"}},"CHF/km",{"$f":"'1a. Defaults Segment-Ebene'!F260","v":"Standardwert: 0.050 CHF/km"}]
[null,null,"Restwert Verbrenner",{"$f":"'1a. Defaults Segment-Ebene'!D261","v":{"v":0.31606388888888887,"d":"31.6%"}},"",{"$f":"\"Angestrebter Restwert beim Verkauf/Rückgabe des Fahrzeugs in % der Anschaffungskosten. \"&'1a. Defaults Segment-Ebene'!F261","v":"Angestrebter Restwert beim Verkauf/Rückgabe des Fahrzeugs in % der Anschaffungskosten. Standardwert: 31.6%"}]
[null,null,"Anschaffungspreis inkl. Flottenrabatt E-Fahrzeug",{"$f":"'1a. Defaults Segment-Ebene'!D262","v":{"v":28810.890000000003,"d":"28,811"}},"CHF",{"$f":"'1a. Defaults Segment-Ebene'!F262","v":"Standardwert: 28’811 CHF"}]
[null,null,"Service- und Reparaturkosten E-Fahrzeug",{"$f":"'1a. Defaults Segment-Ebene'!D263","v":0.025},"CHF/km",{"$f":"'1a. Defaults Segment-Ebene'!F263","v":"Standardwert: 0.025 CHF/km"}]
[null,null,"Restwert E-Fahrzeug",{"$f":"'1a. Defaults Segment-Ebene'!D264","v":{"v":0.30658197222222217,"d":"30.7%"}},"",{"$f":"\"Angestrebter Restwert beim Verkauf/Rückgabe des Fahrzeugs in % der Anschaffungskosten. \"&'1a. Defaults Segment-Ebene'!F264","v":"Angestrebter Restwert beim Verkauf/Rückgabe des Fahrzeugs in % der Anschaffungskosten. Standardwert: 30.7%"}]
[]
[]
[null,null,"Segment H"]
[]
[null,null,{"$f":"IF(C233<>\"\",C233,\"\")","v":"Segmentstruktur"},null,{"$f":"IF(E233<>\"\",E233,\"\")","v":""}]
[null,null,"Anzahl Fahrzeuge",1,""]
[null,null,"Einsatzart","Poolfahrzeuge","","Poolfahrzeuge werden ausschliesslich beruflich genutzt und verbleiben üblicherweise über Nacht am Firmenstandort.\nDienstfahrzeuge werden von einer oder mehreren Personen beruflich und privat genutzt und können typischerweise auch für den Arbeitsweg verwendet werden."]
[null,null,"Einsatzgebiet","regional",""]
[null,null,"Heimlademöglichkeit",{"$f":"'1a. Defaults Segment-Ebene'!D273","v":"Nein"},"","Angabe, ob Fahrzeuge am Wohnort der Nutzenden geladen werden können. Wirkt sich nur auf Dienstfahrzeuge aus. Poolfahrzeuge werden nie am Wohnort geladen."]
[null,null,"",null,""]
[null,null,"Fahrzeugdaten",null,""]
[null,null,"Fahrzeuggrösse","Mittelklasse",""]
[null,null,"Treibstoffverbrauch Verbrenner",{"$f":"'1a. Defaults Segment-Ebene'!D277","v":5.8},"l/100 km",{"$f":"'1a. Defaults Segment-Ebene'!F277","v":"Standardwert: 5.8 l/100 km"}]
[null,null,"Energieverbrauch E-Fahrzeug",{"$f":"'1a. Defaults Segment-Ebene'!D278","v":15.1},"kWh/100 km",{"$f":"'1a. Defaults Segment-Ebene'!F278","v":"Standardwert: 15.1 kWh/100 km"}]
[null,null,"Batteriekapazität (netto)",{"$f":"'1a. Defaults Segment-Ebene'!D279","v":58.625},"kWh",{"$f":"\"Effektiv nutzbare Speicherkapazität, berechnet aus Bruttokapazität abzüglich herstellerseitiger Sicherheits- und Gesundheitspuffer. I.d.R. ca. 90-95% der Bruttokapazität. \"&'1a. Defaults Segment-Ebene'!F279","v":"Effektiv nutzbare Speicherkapazität, berechnet aus Bruttokapazität abzüglich herstellerseitiger Sicherheits- und Gesundheitspuffer. I.d.R. ca. 90-95% der Bruttokapazität. Standardwert: 58.6 kWh"}]
[null,null,"",null,""]
[null,null,"Fahr- und Nutzungsprofil (Angabe pro Fahrzeug)",null,""]
[null,null,"Nutzungsmuster","Werktagsbetrieb","","Das Nutzungsmuster beschreibt, wie intensiv die Fahrzeuge während der Arbeitszeit eingesetzt werden. Entsprechend werden unten verschiedene Standardwerte angepasst. Die private Nutzung der Dienstfahrzeuge wird im Werkzeug nicht berücksichtigt."]
[null,null,"Anzahl Arbeitstage pro Jahr",{"$f":"'1a. Defaults Segment-Ebene'!D283","v":260},"",{"$f":"'1a. Defaults Segment-Ebene'!F283","v":"Standardwert: 260"}]
[null,null,"Fahrdistanz während der Arbeitszeit",{"$f":"'1a. Defaults Segment-Ebene'!D284","v":100},"km/Tag",{"$f":"\"Durchschnittliche Fahrdistanz pro Fahrzeug an einem typischen Arbeitstag exkl. Pendlerdistanz. \"&'1a. Defaults Segment-Ebene'!F284","v":"Durchschnittliche Fahrdistanz pro Fahrzeug an einem typischen Arbeitstag exkl. Pendlerdistanz. Standardwert: 100 km/Tag"}]
[null,null,"Pendeldistanz (Hin- und Rückfahrt)",{"$f":"'1a. Defaults Segment-Ebene'!D285","v":0},"km/Tag",{"$f":"\"Pendlerdistanz pro Fahrzeug an einem typischen Arbeitstag. \"&'1a. Defaults Segment-Ebene'!F285","v":"Pendlerdistanz pro Fahrzeug an einem typischen Arbeitstag. Standardwert: 0 km/Tag"}]
[null,null,"Anzahl Einsätze pro Tag",{"$f":"'1a. Defaults Segment-Ebene'!D286","v":1},"",{"$f":"\"Alle Einsätze an einem typischen Arbeitstag. Ein Einsatz wird definiert als Fahrt ab Firmenstandort bis und mit Rückkehr zurück an den Firmenstandort. \"&'1a. Defaults Segment-Ebene'!F286","v":"Alle Einsätze an einem typischen Arbeitstag. Ein Einsatz wird definiert als Fahrt ab Firmenstandort bis und mit Rückkehr zurück an den Firmenstandort. Standardwert: 1"}]
[null,null,"Anzahl Pausen pro Tag",{"$f":"D286","v":1},""]
[null,null,"Standzeit pro Pause am Firmenstandort",{"$f":"'1a. Defaults Segment-Ebene'!D288","v":1},"Stunden",{"$f":"'1a. Defaults Segment-Ebene'!F288","v":"Standardwert: 1 Stunde"}]
[null,null,"Standzeit über Nacht",{"$f":"'1a. Defaults Segment-Ebene'!D289","v":8},"Stunden",{"$f":"\"Verfügbare Ladezeit am Wohnort oder Firmenstandort über Nacht. \"&'1a. Defaults Segment-Ebene'!F289","v":"Verfügbare Ladezeit am Wohnort oder Firmenstandort über Nacht. Standardwert: 8 Stunden"}]
[null,null,"Fahrzeuge pro Ladepunkt, Firmenstandort (tagsüber)",{"$f":"'1a. Defaults Segment-Ebene'!D290","v":1},"",{"$f":"\"Typischerweise kann bei Schichtbetrieb ein Ladepunkt am Firmenstandort für mehrere Fahrzeuge verwendet werden. \"&'1a. Defaults Segment-Ebene'!F290","v":"Typischerweise kann bei Schichtbetrieb ein Ladepunkt am Firmenstandort für mehrere Fahrzeuge verwendet werden. Standardwert: 1"}]
[null,null,"",null,""]
[null,null,"Kosten (Angabe pro Fahrzeug)",null,""]
[null,null,"Laufzeit",48,"Monate"]
[null,null,"Leasing-Zinssatz",{"$f":"'1a. Defaults Segment-Ebene'!D294","v":{"v":0.03,"d":"3.0%"}},"",{"$f":"'1a. Defaults Segment-Ebene'!F294","v":"Standardwert: 3.0%"}]
[null,null,"Anschaffungspreis inkl. Flottenrabatt Verbrenner",{"$f":"'1a. Defaults Segment-Ebene'!D295","v":{"v":27219.464999999997,"d":"27,219"}},"CHF",{"$f":"'1a. Defaults Segment-Ebene'!F295","v":"Standardwert: 27’219 CHF"}]
[null,null,"Service- und Reparaturkosten Verbrenner",{"$f":"'1a. Defaults Segment-Ebene'!D296","v":{"v":0.05,"d":"0.050"}},"CHF/km",{"$f":"'1a. Defaults Segment-Ebene'!F296","v":"Standardwert: 0.050 CHF/km"}]
[null,null,"Restwert Verbrenner",{"$f":"'1a. Defaults Segment-Ebene'!D297","v":{"v":0.31606388888888887,"d":"31.6%"}},"",{"$f":"\"Angestrebter Restwert beim Verkauf/Rückgabe des Fahrzeugs in % der Anschaffungskosten. \"&'1a. Defaults Segment-Ebene'!F297","v":"Angestrebter Restwert beim Verkauf/Rückgabe des Fahrzeugs in % der Anschaffungskosten. Standardwert: 31.6%"}]
[null,null,"Anschaffungspreis inkl. Flottenrabatt E-Fahrzeug",{"$f":"'1a. Defaults Segment-Ebene'!D298","v":{"v":28810.890000000003,"d":"28,811"}},"CHF",{"$f":"'1a. Defaults Segment-Ebene'!F298","v":"Standardwert: 28’811 CHF"}]
[null,null,"Service- und Reparaturkosten E-Fahrzeug",{"$f":"'1a. Defaults Segment-Ebene'!D299","v":0.025},"CHF/km",{"$f":"'1a. Defaults Segment-Ebene'!F299","v":"Standardwert: 0.025 CHF/km"}]
[null,null,"Restwert E-Fahrzeug",{"$f":"'1a. Defaults Segment-Ebene'!D300","v":{"v":0.30658197222222217,"d":"30.7%"}},"",{"$f":"\"Angestrebter Restwert beim Verkauf/Rückgabe des Fahrzeugs in % der Anschaffungskosten. \"&'1a. Defaults Segment-Ebene'!F300","v":"Angestrebter Restwert beim Verkauf/Rückgabe des Fahrzeugs in % der Anschaffungskosten. Standardwert: 30.7%"}]
[]
[]
[null,null,"Segment I"]
[]
[null,null,{"$f":"IF(C269<>\"\",C269,\"\")","v":"Segmentstruktur"},null,{"$f":"IF(E269<>\"\",E269,\"\")","v":""}]
[null,null,"Anzahl Fahrzeuge",1,""]
[null,null,"Einsatzart","Poolfahrzeuge","","Poolfahrzeuge werden ausschliesslich beruflich genutzt und verbleiben üblicherweise über Nacht am Firmenstandort.\nDienstfahrzeuge werden von einer oder mehreren Personen beruflich und privat genutzt und können typischerweise auch für den Arbeitsweg verwendet werden."]
[null,null,"Einsatzgebiet","regional",""]
[null,null,"Heimlademöglichkeit",{"$f":"'1a. Defaults Segment-Ebene'!D309","v":"Nein"},"","Angabe, ob Fahrzeuge am Wohnort der Nutzenden geladen werden können. Wirkt sich nur auf Dienstfahrzeuge aus. Poolfahrzeuge werden nie am Wohnort geladen."]
[null,null,"",null,""]
[null,null,"Fahrzeugdaten",null,""]
[null,null,"Fahrzeuggrösse","Mittelklasse",""]
[null,null,"Treibstoffverbrauch Verbrenner",{"$f":"'1a. Defaults Segment-Ebene'!D313","v":5.8},"l/100 km",{"$f":"'1a. Defaults Segment-Ebene'!F313","v":"Standardwert: 5.8 l/100 km"}]
[null,null,"Energieverbrauch E-Fahrzeug",{"$f":"'1a. Defaults Segment-Ebene'!D314","v":15.1},"kWh/100 km",{"$f":"'1a. Defaults Segment-Ebene'!F314","v":"Standardwert: 15.1 kWh/100 km"}]
[null,null,"Batteriekapazität (netto)",{"$f":"'1a. Defaults Segment-Ebene'!D315","v":58.625},"kWh",{"$f":"\"Effektiv nutzbare Speicherkapazität, berechnet aus Bruttokapazität abzüglich herstellerseitiger Sicherheits- und Gesundheitspuffer. I.d.R. ca. 90-95% der Bruttokapazität. \"&'1a. Defaults Segment-Ebene'!F315","v":"Effektiv nutzbare Speicherkapazität, berechnet aus Bruttokapazität abzüglich herstellerseitiger Sicherheits- und Gesundheitspuffer. I.d.R. ca. 90-95% der Bruttokapazität. Standardwert: 58.6 kWh"}]
[null,null,"",null,""]
[null,null,"Fahr- und Nutzungsprofil (Angabe pro Fahrzeug)",null,""]
[null,null,"Nutzungsmuster","Werktagsbetrieb","","Das Nutzungsmuster beschreibt, wie intensiv die Fahrzeuge während der Arbeitszeit eingesetzt werden. Entsprechend werden unten verschiedene Standardwerte angepasst. Die private Nutzung der Dienstfahrzeuge wird im Werkzeug nicht berücksichtigt."]
[null,null,"Anzahl Arbeitstage pro Jahr",{"$f":"'1a. Defaults Segment-Ebene'!D319","v":260},"",{"$f":"'1a. Defaults Segment-Ebene'!F319","v":"Standardwert: 260"}]
[null,null,"Fahrdistanz während der Arbeitszeit",{"$f":"'1a. Defaults Segment-Ebene'!D320","v":100},"km/Tag",{"$f":"\"Durchschnittliche Fahrdistanz pro Fahrzeug an einem typischen Arbeitstag exkl. Pendlerdistanz. \"&'1a. Defaults Segment-Ebene'!F320","v":"Durchschnittliche Fahrdistanz pro Fahrzeug an einem typischen Arbeitstag exkl. Pendlerdistanz. Standardwert: 100 km/Tag"}]
[null,null,"Pendeldistanz (Hin- und Rückfahrt)",{"$f":"'1a. Defaults Segment-Ebene'!D321","v":0},"km/Tag",{"$f":"\"Pendlerdistanz pro Fahrzeug an einem typischen Arbeitstag. \"&'1a. Defaults Segment-Ebene'!F321","v":"Pendlerdistanz pro Fahrzeug an einem typischen Arbeitstag. Standardwert: 0 km/Tag"}]
[null,null,"Anzahl Einsätze pro Tag",{"$f":"'1a. Defaults Segment-Ebene'!D322","v":1},"",{"$f":"\"Alle Einsätze an einem typischen Arbeitstag. Ein Einsatz wird definiert als Fahrt ab Firmenstandort bis und mit Rückkehr zurück an den Firmenstandort. \"&'1a. Defaults Segment-Ebene'!F322","v":"Alle Einsätze an einem typischen Arbeitstag. Ein Einsatz wird definiert als Fahrt ab Firmenstandort bis und mit Rückkehr zurück an den Firmenstandort. Standardwert: 1"}]
[null,null,"Anzahl Pausen pro Tag",{"$f":"D322","v":1},""]
[null,null,"Standzeit pro Pause am Firmenstandort",{"$f":"'1a. Defaults Segment-Ebene'!D324","v":1},"Stunden",{"$f":"'1a. Defaults Segment-Ebene'!F324","v":"Standardwert: 1 Stunde"}]
[null,null,"Standzeit über Nacht",{"$f":"'1a. Defaults Segment-Ebene'!D325","v":8},"Stunden",{"$f":"\"Verfügbare Ladezeit am Wohnort oder Firmenstandort über Nacht. \"&'1a. Defaults Segment-Ebene'!F325","v":"Verfügbare Ladezeit am Wohnort oder Firmenstandort über Nacht. Standardwert: 8 Stunden"}]
[null,null,"Fahrzeuge pro Ladepunkt, Firmenstandort (tagsüber)",{"$f":"'1a. Defaults Segment-Ebene'!D326","v":1},"",{"$f":"\"Typischerweise kann bei Schichtbetrieb ein Ladepunkt am Firmenstandort für mehrere Fahrzeuge verwendet werden. \"&'1a. Defaults Segment-Ebene'!F326","v":"Typischerweise kann bei Schichtbetrieb ein Ladepunkt am Firmenstandort für mehrere Fahrzeuge verwendet werden. Standardwert: 1"}]
[null,null,"",null,""]
[null,null,"Kosten (Angabe pro Fahrzeug)",null,""]
[null,null,"Laufzeit",48,"Monate"]
[null,null,"Leasing-Zinssatz",{"$f":"'1a. Defaults Segment-Ebene'!D330","v":{"v":0.03,"d":"3.0%"}},"",{"$f":"'1a. Defaults Segment-Ebene'!F330","v":"Standardwert: 3.0%"}]
[null,null,"Anschaffungspreis inkl. Flottenrabatt Verbrenner",{"$f":"'1a. Defaults Segment-Ebene'!D331","v":{"v":27219.464999999997,"d":"27,219"}},"CHF",{"$f":"'1a. Defaults Segment-Ebene'!F331","v":"Standardwert: 27’219 CHF"}]
[null,null,"Service- und Reparaturkosten Verbrenner",{"$f":"'1a. Defaults Segment-Ebene'!D332","v":{"v":0.05,"d":"0.050"}},"CHF/km",{"$f":"'1a. Defaults Segment-Ebene'!F332","v":"Standardwert: 0.050 CHF/km"}]
[null,null,"Restwert Verbrenner",{"$f":"'1a. Defaults Segment-Ebene'!D333","v":{"v":0.31606388888888887,"d":"31.6%"}},"",{"$f":"\"Angestrebter Restwert beim Verkauf/Rückgabe des Fahrzeugs in % der Anschaffungskosten. \"&'1a. Defaults Segment-Ebene'!F333","v":"Angestrebter Restwert beim Verkauf/Rückgabe des Fahrzeugs in % der Anschaffungskosten. Standardwert: 31.6%"}]
[null,null,"Anschaffungspreis inkl. Flottenrabatt E-Fahrzeug",{"$f":"'1a. Defaults Segment-Ebene'!D334","v":{"v":28810.890000000003,"d":"28,811"}},"CHF",{"$f":"'1a. Defaults Segment-Ebene'!F334","v":"Standardwert: 28’811 CHF"}]
[null,null,"Service- und Reparaturkosten E-Fahrzeug",{"$f":"'1a. Defaults Segment-Ebene'!D335","v":0.025},"CHF/km",{"$f":"'1a. Defaults Segment-Ebene'!F335","v":"Standardwert: 0.025 CHF/km"}]
[null,null,"Restwert E-Fahrzeug",{"$f":"'1a. Defaults Segment-Ebene'!D336","v":{"v":0.30658197222222217,"d":"30.7%"}},"",{"$f":"\"Angestrebter Restwert beim Verkauf/Rückgabe des Fahrzeugs in % der Anschaffungskosten. \"&'1a. Defaults Segment-Ebene'!F336","v":"Angestrebter Restwert beim Verkauf/Rückgabe des Fahrzeugs in % der Anschaffungskosten. Standardwert: 30.7%"}]
[]
[]
[null,null,"Segment J"]
[]
[null,null,{"$f":"IF(C305<>\"\",C305,\"\")","v":"Segmentstruktur"},null,{"$f":"IF(E305<>\"\",E305,\"\")","v":""}]
[null,null,{"$f":"IF(C306<>\"\",C306,\"\")","v":"Anzahl Fahrzeuge"},1,{"$f":"IF(E306<>\"\",E306,\"\")","v":""}]
[null,null,{"$f":"IF(C307<>\"\",C307,\"\")","v":"Einsatzart"},"Poolfahrzeuge",{"$f":"IF(E307<>\"\",E307,\"\")","v":""},"Poolfahrzeuge werden ausschliesslich beruflich genutzt und verbleiben üblicherweise über Nacht am Firmenstandort.\nDienstfahrzeuge werden von einer oder mehreren Personen beruflich und privat genutzt und können typischerweise auch für den Arbeitsweg verwendet werden."]
[null,null,{"$f":"IF(C308<>\"\",C308,\"\")","v":"Einsatzgebiet"},"regional",{"$f":"IF(E308<>\"\",E308,\"\")","v":""}]
[null,null,{"$f":"IF(C309<>\"\",C309,\"\")","v":"Heimlademöglichkeit"},{"$f":"'1a. Defaults Segment-Ebene'!D345","v":"Nein"},{"$f":"IF(E309<>\"\",E309,\"\")","v":""},"Angabe, ob Fahrzeuge am Wohnort der Nutzenden geladen werden können. Wirkt sich nur auf Dienstfahrzeuge aus. Poolfahrzeuge werden nie am Wohnort geladen."]
[null,null,{"$f":"IF(C310<>\"\",C310,\"\")","v":""},null,{"$f":"IF(E310<>\"\",E310,\"\")","v":""}]
[null,null,{"$f":"IF(C311<>\"\",C311,\"\")","v":"Fahrzeugdaten"},null,{"$f":"IF(E311<>\"\",E311,\"\")","v":""}]
[null,null,{"$f":"IF(C312<>\"\",C312,\"\")","v":"Fahrzeuggrösse"},"Mittelklasse",{"$f":"IF(E312<>\"\",E312,\"\")","v":""}]
[null,null,{"$f":"IF(C313<>\"\",C313,\"\")","v":"Treibstoffverbrauch Verbrenner"},{"$f":"'1a. Defaults Segment-Ebene'!D349","v":5.8},{"$f":"IF(E313<>\"\",E313,\"\")","v":"l/100 km"},{"$f":"'1a. Defaults Segment-Ebene'!F349","v":"Standardwert: 5.8 l/100 km"}]
[null,null,{"$f":"IF(C314<>\"\",C314,\"\")","v":"Energieverbrauch E-Fahrzeug"},{"$f":"'1a. Defaults Segment-Ebene'!D350","v":15.1},{"$f":"IF(E314<>\"\",E314,\"\")","v":"kWh/100 km"},{"$f":"'1a. Defaults Segment-Ebene'!F350","v":"Standardwert: 15.1 kWh/100 km"}]
[null,null,{"$f":"IF(C315<>\"\",C315,\"\")","v":"Batteriekapazität (netto)"},{"$f":"'1a. Defaults Segment-Ebene'!D351","v":58.625},{"$f":"IF(E315<>\"\",E315,\"\")","v":"kWh"},{"$f":"\"Effektiv nutzbare Speicherkapazität, berechnet aus Bruttokapazität abzüglich herstellerseitiger Sicherheits- und Gesundheitspuffer. I.d.R. ca. 90-95% der Bruttokapazität. \"&'1a. Defaults Segment-Ebene'!F351","v":"Effektiv nutzbare Speicherkapazität, berechnet aus Bruttokapazität abzüglich herstellerseitiger Sicherheits- und Gesundheitspuffer. I.d.R. ca. 90-95% der Bruttokapazität. Standardwert: 58.6 kWh"}]
[null,null,{"$f":"IF(C316<>\"\",C316,\"\")","v":""},null,{"$f":"IF(E316<>\"\",E316,\"\")","v":""}]
[null,null,{"$f":"IF(C317<>\"\",C317,\"\")","v":"Fahr- und Nutzungsprofil (Angabe pro Fahrzeug)"},null,{"$f":"IF(E317<>\"\",E317,\"\")","v":""}]
[null,null,{"$f":"IF(C318<>\"\",C318,\"\")","v":"Nutzungsmuster"},"Werktagsbetrieb",{"$f":"IF(E318<>\"\",E318,\"\")","v":""},"Das Nutzungsmuster beschreibt, wie intensiv die Fahrzeuge während der Arbeitszeit eingesetzt werden. Entsprechend werden unten verschiedene Standardwerte angepasst. Die private Nutzung der Dienstfahrzeuge wird im Werkzeug nicht berücksichtigt."]
[null,null,{"$f":"IF(C319<>\"\",C319,\"\")","v":"Anzahl Arbeitstage pro Jahr"},{"$f":"'1a. Defaults Segment-Ebene'!D355","v":260},{"$f":"IF(E319<>\"\",E319,\"\")","v":""},{"$f":"'1a. Defaults Segment-Ebene'!F355","v":"Standardwert: 260"}]
[null,null,{"$f":"IF(C320<>\"\",C320,\"\")","v":"Fahrdistanz während der Arbeitszeit"},{"$f":"'1a. Defaults Segment-Ebene'!D356","v":100},{"$f":"IF(E320<>\"\",E320,\"\")","v":"km/Tag"},{"$f":"\"Durchschnittliche Fahrdistanz pro Fahrzeug an einem typischen Arbeitstag exkl. Pendlerdistanz. \"&'1a. Defaults Segment-Ebene'!F356","v":"Durchschnittliche Fahrdistanz pro Fahrzeug an einem typischen Arbeitstag exkl. Pendlerdistanz. Standardwert: 100 km/Tag"}]
[null,null,{"$f":"IF(C321<>\"\",C321,\"\")","v":"Pendeldistanz (Hin- und Rückfahrt)"},{"$f":"'1a. Defaults Segment-Ebene'!D357","v":0},{"$f":"IF(E321<>\"\",E321,\"\")","v":"km/Tag"},{"$f":"\"Pendlerdistanz pro Fahrzeug an einem typischen Arbeitstag. \"&'1a. Defaults Segment-Ebene'!F357","v":"Pendlerdistanz pro Fahrzeug an einem typischen Arbeitstag. Standardwert: 0 km/Tag"}]
[null,null,{"$f":"IF(C322<>\"\",C322,\"\")","v":"Anzahl Einsätze pro Tag"},{"$f":"'1a. Defaults Segment-Ebene'!D358","v":1},{"$f":"IF(E322<>\"\",E322,\"\")","v":""},{"$f":"\"Alle Einsätze an einem typischen Arbeitstag. Ein Einsatz wird definiert als Fahrt ab Firmenstandort bis und mit Rückkehr zurück an den Firmenstandort. \"&'1a. Defaults Segment-Ebene'!F358","v":"Alle Einsätze an einem typischen Arbeitstag. Ein Einsatz wird definiert als Fahrt ab Firmenstandort bis und mit Rückkehr zurück an den Firmenstandort. Standardwert: 1"}]
[null,null,{"$f":"IF(C323<>\"\",C323,\"\")","v":"Anzahl Pausen pro Tag"},{"$f":"D358","v":1},{"$f":"IF(E323<>\"\",E323,\"\")","v":""}]
[null,null,{"$f":"IF(C324<>\"\",C324,\"\")","v":"Standzeit pro Pause am Firmenstandort"},{"$f":"'1a. Defaults Segment-Ebene'!D360","v":1},{"$f":"IF(E324<>\"\",E324,\"\")","v":"Stunden"},{"$f":"'1a. Defaults Segment-Ebene'!F360","v":"Standardwert: 1 Stunde"}]
[null,null,{"$f":"IF(C325<>\"\",C325,\"\")","v":"Standzeit über Nacht"},{"$f":"'1a. Defaults Segment-Ebene'!D361","v":8},{"$f":"IF(E325<>\"\",E325,\"\")","v":"Stunden"},{"$f":"\"Verfügbare Ladezeit am Wohnort oder Firmenstandort über Nacht. \"&'1a. Defaults Segment-Ebene'!F361","v":"Verfügbare Ladezeit am Wohnort oder Firmenstandort über Nacht. Standardwert: 8 Stunden"}]
[null,null,{"$f":"IF(C326<>\"\",C326,\"\")","v":"Fahrzeuge pro Ladepunkt, Firmenstandort (tagsüber)"},{"$f":"'1a. Defaults Segment-Ebene'!D362","v":1},{"$f":"IF(E326<>\"\",E326,\"\")","v":""},{"$f":"\"Typischerweise kann bei Schichtbetrieb ein Ladepunkt am Firmenstandort für mehrere Fahrzeuge verwendet werden. \"&'1a. Defaults Segment-Ebene'!F362","v":"Typischerweise kann bei Schichtbetrieb ein Ladepunkt am Firmenstandort für mehrere Fahrzeuge verwendet werden. Standardwert: 1"}]
[null,null,{"$f":"IF(C327<>\"\",C327,\"\")","v":""},null,{"$f":"IF(E327<>\"\",E327,\"\")","v":""}]
[null,null,{"$f":"IF(C328<>\"\",C328,\"\")","v":"Kosten (Angabe pro Fahrzeug)"},null,{"$f":"IF(E328<>\"\",E328,\"\")","v":""}]
[null,null,{"$f":"IF(C329<>\"\",C329,\"\")","v":"Laufzeit"},48,{"$f":"IF(E329<>\"\",E329,\"\")","v":"Monate"}]
[null,null,{"$f":"IF(C330<>\"\",C330,\"\")","v":"Leasing-Zinssatz"},{"$f":"'1a. Defaults Segment-Ebene'!D366","v":{"v":0.03,"d":"3.0%"}},{"$f":"IF(E330<>\"\",E330,\"\")","v":""},{"$f":"'1a. Defaults Segment-Ebene'!F366","v":"Standardwert: 3.0%"}]
[null,null,{"$f":"IF(C331<>\"\",C331,\"\")","v":"Anschaffungspreis inkl. Flottenrabatt Verbrenner"},{"$f":"'1a. Defaults Segment-Ebene'!D367","v":{"v":27219.464999999997,"d":"27,219"}},{"$f":"IF(E331<>\"\",E331,\"\")","v":"CHF"},{"$f":"'1a. Defaults Segment-Ebene'!F367","v":"Standardwert: 27’219 CHF"}]
[null,null,{"$f":"IF(C332<>\"\",C332,\"\")","v":"Service- und Reparaturkosten Verbrenner"},{"$f":"'1a. Defaults Segment-Ebene'!D368","v":{"v":0.05,"d":"0.050"}},{"$f":"IF(E332<>\"\",E332,\"\")","v":"CHF/km"},{"$f":"'1a. Defaults Segment-Ebene'!F368","v":"Standardwert: 0.050 CHF/km"}]
[null,null,{"$f":"IF(C333<>\"\",C333,\"\")","v":"Restwert Verbrenner"},{"$f":"'1a. Defaults Segment-Ebene'!D369","v":{"v":0.31606388888888887,"d":"31.6%"}},{"$f":"IF(E333<>\"\",E333,\"\")","v":""},{"$f":"\"Angestrebter Restwert beim Verkauf/Rückgabe des Fahrzeugs in % der Anschaffungskosten. \"&'1a. Defaults Segment-Ebene'!F369","v":"Angestrebter Restwert beim Verkauf/Rückgabe des Fahrzeugs in % der Anschaffungskosten. Standardwert: 31.6%"}]
[null,null,{"$f":"IF(C334<>\"\",C334,\"\")","v":"Anschaffungspreis inkl. Flottenrabatt E-Fahrzeug"},{"$f":"'1a. Defaults Segment-Ebene'!D370","v":{"v":28810.890000000003,"d":"28,811"}},{"$f":"IF(E334<>\"\",E334,\"\")","v":"CHF"},{"$f":"'1a. Defaults Segment-Ebene'!F370","v":"Standardwert: 28’811 CHF"}]
[null,null,{"$f":"IF(C335<>\"\",C335,\"\")","v":"Service- und Reparaturkosten E-Fahrzeug"},{"$f":"'1a. Defaults Segment-Ebene'!D371","v":0.025},{"$f":"IF(E335<>\"\",E335,\"\")","v":"CHF/km"},{"$f":"'1a. Defaults Segment-Ebene'!F371","v":"Standardwert: 0.025 CHF/km"}]
[null,null,{"$f":"IF(C336<>\"\",C336,\"\")","v":"Restwert E-Fahrzeug"},{"$f":"'1a. Defaults Segment-Ebene'!D372","v":{"v":0.30658197222222217,"d":"30.7%"}},{"$f":"IF(E336<>\"\",E336,\"\")","v":""},{"$f":"\"Angestrebter Restwert beim Verkauf/Rückgabe des Fahrzeugs in % der Anschaffungskosten. \"&'1a. Defaults Segment-Ebene'!F372","v":"Angestrebter Restwert beim Verkauf/Rückgabe des Fahrzeugs in % der Anschaffungskosten. Standardwert: 30.7%"}]

{"sheet":"Ergebnisse (Outputs)","index":2,"n_rows":83,"n_cols":22,"rows_kept":83,"merged":[[4,2,6,2],[4,3,6,3],[4,4,6,4],[4,5,6,5],[4,6,6,6],[4,7,6,7],[4,8,6,8],[4,9,6,9],[9,18,10,18],[23,16,23,17],[23,18,23,19],[23,20,23,21],[37,15,38,21],[40,2,40,4],[40,18,41,18],[40,19,41,19],[40,20,41,20],[40,21,41,21],[42,15,42,17],[43,15,44,17],[43,18,44,18],[43,19,44,19],[43,20,44,20],[43,21,44,21],[82,2,87,9],[82,13,87,21]]}
[]
[null,null,"Zusammenfassung der Eingaben"]
[]
[null,null,"Segmente",{"$nulls":8},"Flotte",{"$nulls":5},"Energiekosten"]
[{"$nulls":3},"Einsatzart","Anzahl Fahrzeuge","Fahrzeug-grösse","Jährliche Fahrdistanz (km)","Heimlade-möglichkeit","Ladezeit über Nacht\n(Stunden)","Ladezeit Firmenstandort tagsüber (Stunden)",{"$nulls":3},"Dienst-\nfahrzeuge","Pool-fahrzeuge","Total",null,null,"Wohnort","Firmenstandort","öffentlich","Einheit"]
[{"$nulls":11},{"$f":"INDEX(Grösse,ROW()-ROW($L$6)+1)","v":"Kleinwagen"},null,{"$f":"SUMIF('1c. Inputs Segment Summary'!$K$2:$K$11,$L6,'1c. Inputs Segment Summary'!$H$2:$H$11)","v":0},{"$f":"SUMIF('1c. Inputs Segment Summary'!$K$2:$K$11,$L6,'1c. Inputs Segment Summary'!$G$2:$G$11)","v":0},{"$f":"SUMIF('1c. Inputs Segment Summary'!$K$2:$K$11,$L6,'1c. Inputs Segment Summary'!$F$2:$F$11)","v":0},null,"Strom",{"$f":"'Eingaben (Inputs)'!J19","v":0.24},{"$f":"'Eingaben (Inputs)'!J20","v":0.24},{"$f":"'Eingaben (Inputs)'!J21","v":0.55},{"$f":"'Eingaben (Inputs)'!K19","v":"CHF/kWh"}]
[{"$nulls":11},{"$f":"INDEX(Grösse,ROW()-ROW($L$6)+1)","v":"Mittelklasse"},null,{"$f":"SUMIF('1c. Inputs Segment Summary'!$K$2:$K$11,$L7,'1c. Inputs Segment Summary'!$H$2:$H$11)","v":0},{"$f":"SUMIF('1c. Inputs Segment Summary'!$K$2:$K$11,$L7,'1c. Inputs Segment Summary'!$G$2:$G$11)","v":1},{"$f":"SUMIF('1c. Inputs Segment Summary'!$K$2:$K$11,$L7,'1c. Inputs Segment Summary'!$F$2:$F$11)","v":1}]
[null,null,{"$f":"'1c. Inputs Segment Summary'!A2","v":"Segment A"},{"$f":"'1c. Inputs Segment Summary'!E2","v":"Poolfahrzeuge"},{"$f":"'1c. Inputs Segment Summary'!F2","v":1},{"$f":"'1c. Inputs Segment Summary'!K2","v":"Mittelklasse"},{"$f":"SUM('1c. Inputs Segment Summary'!Q2:R2)*'1c. Inputs Segment Summary'!P2","v":{"v":26000,"d":"26,000"}},{"$f":"IF('1c. Inputs Segment Summary'!J2,\"Ja\",\"Nein\")","v":"Nein"},{"$f":"'1c. Inputs Segment Summary'!V2","v":{"v":8,"d":"8.0"}},{"$f":"MAX('1c. Inputs Segment Summary'!U2*'1c. Inputs Segment Summary'!T2,0)","v":{"v":1,"d":"1.0"}},null,{"$f":"INDEX(Grösse,ROW()-ROW($L$6)+1)","v":"Oberklasse"},null,{"$f":"SUMIF('1c. Inputs Segment Summary'!$K$2:$K$11,$L8,'1c. Inputs Segment Summary'!$H$2:$H$11)","v":0},{"$f":"SUMIF('1c. Inputs Segment Summary'!$K$2:$K$11,$L8,'1c. Inputs Segment Summary'!$G$2:$G$11)","v":0},{"$f":"SUMIF('1c. Inputs Segment Summary'!$K$2:$K$11,$L8,'1c. Inputs Segment Summary'!$F$2:$F$11)","v":0}]
[null,null,{"$f":"'1c. Inputs Segment Summary'!A3","v":"Segment B"},{"$f":"'1c. Inputs Segment Summary'!E3","v":"Poolfahrzeuge"},{"$f":"'1c. Inputs Segment Summary'!F3","v":0},{"$f":"'1c. Inputs Segment Summary'!K3","v":"Mittelklasse"},{"$f":"SUM('1c. Inputs Segment Summary'!Q3:R3)*'1c. Inputs Segment Summary'!P3","v":{"v":26000,"d":"26,000"}},{"$f":"IF('1c. Inputs Segment Summary'!J3,\"Ja\",\"Nein\")","v":"Nein"},{"$f":"'1c. Inputs Segment Summary'!V3","v":{"v":8,"d":"8.0"}},{"$f":"MAX('1c. Inputs Segment Summary'!U3*'1c. Inputs Segment Summary'!T3,0)","v":{"v":1,"d":"1.0"}},null,{"$f":"INDEX(Grösse,ROW()-ROW($L$6)+1)","v":"SUV"},null,{"$f":"SUMIF('1c. Inputs Segment Summary'!$K$2:$K$11,$L9,'1c. Inputs Segment Summary'!$H$2:$H$11)","v":0},{"$f":"SUMIF('1c. Inputs Segment Summary'!$K$2:$K$11,$L9,'1c. Inputs Segment Summary'!$G$2:$G$11)","v":0},{"$f":"SUMIF('1c. Inputs Segment Summary'!$K$2:$K$11,$L9,'1c. Inputs Segment Summary'!$F$2:$F$11)","v":0}]
[null,null,{"$f":"'1c. Inputs Segment Summary'!A4","v":"Segment C"},{"$f":"'1c. Inputs Segment Summary'!E4","v":"Poolfahrzeuge"},{"$f":"'1c. Inputs Segment Summary'!F4","v":0},{"$f":"'1c. Inputs Segment Summary'!K4","v":"Mittelklasse"},{"$f":"SUM('1c. Inputs Segment Summary'!Q4:R4)*'1c. Inputs Segment Summary'!P4","v":{"v":26000,"d":"26,000"}},{"$f":"IF('1c. Inputs Segment Summary'!J4,\"Ja\",\"Nein\")","v":"Nein"},{"$f":"'1c. Inputs Segment Summary'!V4","v":{"v":8,"d":"8.0"}},{"$f":"MAX('1c. Inputs Segment Summary'!U4*'1c. Inputs Segment Summary'!T4,0)","v":{"v":1,"d":"1.0"}},null,"Total",null,{"$f":"SUM(N6:N9)","v":0},{"$f":"SUM(O6:O9)","v":1},{"$f":"SUM(P6:P9)","v":1},null,null,"standort-\nunabhängig"]
[null,null,{"$f":"'1c. Inputs Segment Summary'!A5","v":"Segment D"},{"$f":"'1c. Inputs Segment Summary'!E5","v":"Poolfahrzeuge"},{"$f":"'1c. Inputs Segment Summary'!F5","v":0},{"$f":"'1c. Inputs Segment Summary'!K5","v":"Mittelklasse"},{"$f":"SUM('1c. Inputs Segment Summary'!Q5:R5)*'1c. Inputs Segment Summary'!P5","v":{"v":26000,"d":"26,000"}},{"$f":"IF('1c. Inputs Segment Summary'!J5,\"Ja\",\"Nein\")","v":"Nein"},{"$f":"'1c. Inputs Segment Summary'!V5","v":{"v":8,"d":"8.0"}},{"$f":"MAX('1c. Inputs Segment Summary'!U5*'1c. Inputs Segment Summary'!T5,0)","v":{"v":1,"d":"1.0"}},{"$nulls":9},"Einheit"]
[null,null,{"$f":"'1c. Inputs Segment Summary'!A6","v":"Segment E"},{"$f":"'1c. Inputs Segment Summary'!E6","v":"Poolfahrzeuge"},{"$f":"'1c. Inputs Segment Summary'!F6","v":0},{"$f":"'1c. Inputs Segment Summary'!K6","v":"Mittelklasse"},{"$f":"SUM('1c. Inputs Segment Summary'!Q6:R6)*'1c. Inputs Segment Summary'!P6","v":{"v":26000,"d":"26,000"}},{"$f":"IF('1c. Inputs Segment Summary'!J6,\"Ja\",\"Nein\")","v":"Nein"},{"$f":"'1c. Inputs Segment Summary'!V6","v":{"v":8,"d":"8.0"}},{"$f":"MAX('1c. Inputs Segment Summary'!U6*'1c. Inputs Segment Summary'!T6,0)","v":{"v":1,"d":"1.0"}},{"$nulls":7},"Treibstoff",{"$f":"'Eingaben (Inputs)'!J18","v":{"v":1.8,"d":"1.80"}},{"$f":"'Eingaben (Inputs)'!K18","v":"CHF/l"}]
[null,null,{"$f":"'1c. Inputs Segment Summary'!A7","v":"Segment F"},{"$f":"'1c. Inputs Segment Summary'!E7","v":"Poolfahrzeuge"},{"$f":"'1c. Inputs Segment Summary'!F7","v":0},{"$f":"'1c. Inputs Segment Summary'!K7","v":"Mittelklasse"},{"$f":"SUM('1c. Inputs Segment Summary'!Q7:R7)*'1c. Inputs Segment Summary'!P7","v":{"v":26000,"d":"26,000"}},{"$f":"IF('1c. Inputs Segment Summary'!J7,\"Ja\",\"Nein\")","v":"Nein"},{"$f":"'1c. Inputs Segment Summary'!V7","v":{"v":8,"d":"8.0"}},{"$f":"MAX('1c. Inputs Segment Summary'!U7*'1c. Inputs Segment Summary'!T7,0)","v":{"v":1,"d":"1.0"}}]
[null,null,{"$f":"'1c. Inputs Segment Summary'!A8","v":"Segment G"},{"$f":"'1c. Inputs Segment Summary'!E8","v":"Poolfahrzeuge"},{"$f":"'1c. Inputs Segment Summary'!F8","v":0},{"$f":"'1c. Inputs Segment Summary'!K8","v":"Mittelklasse"},{"$f":"SUM('1c. Inputs Segment Summary'!Q8:R8)*'1c. Inputs Segment Summary'!P8","v":{"v":26000,"d":"26,000"}},{"$f":"IF('1c. Inputs Segment Summary'!J8,\"Ja\",\"Nein\")","v":"Nein"},{"$f":"'1c. Inputs Segment Summary'!V8","v":{"v":8,"d":"8.0"}},{"$f":"MAX('1c. Inputs Segment Summary'!U8*'1c. Inputs Segment Summary'!T8,0)","v":{"v":1,"d":"1.0"}}]
[null,null,{"$f":"'1c. Inputs Segment Summary'!A9","v":"Segment H"},{"$f":"'1c. Inputs Segment Summary'!E9","v":"Poolfahrzeuge"},{"$f":"'1c. Inputs Segment Summary'!F9","v":0},{"$f":"'1c. Inputs Segment Summary'!K9","v":"Mittelklasse"},{"$f":"SUM('1c. Inputs Segment Summary'!Q9:R9)*'1c. Inputs Segment Summary'!P9","v":{"v":26000,"d":"26,000"}},{"$f":"IF('1c. Inputs Segment Summary'!J9,\"Ja\",\"Nein\")","v":"Nein"},{"$f":"'1c. Inputs Segment Summary'!V9","v":{"v":8,"d":"8.0"}},{"$f":"MAX('1c. Inputs Segment Summary'!U9*'1c. Inputs Segment Summary'!T9,0)","v":{"v":1,"d":"1.0"}}]
[null,null,{"$f":"'1c. Inputs Segment Summary'!A10","v":"Segment I"},{"$f":"'1c. Inputs Segment Summary'!E10","v":"Poolfahrzeuge"},{"$f":"'1c. Inputs Segment Summary'!F10","v":0},{"$f":"'1c. Inputs Segment Summary'!K10","v":"Mittelklasse"},{"$f":"SUM('1c. Inputs Segment Summary'!Q10:R10)*'1c. Inputs Segment Summary'!P10","v":{"v":26000,"d":"26,000"}},{"$f":"IF('1c. Inputs Segment Summary'!J10,\"Ja\",\"Nein\")","v":"Nein"},{"$f":"'1c. Inputs Segment Summary'!V10","v":{"v":8,"d":"8.0"}},{"$f":"MAX('1c. Inputs Segment Summary'!U10*'1c. Inputs Segment Summary'!T10,0)","v":{"v":1,"d":"1.0"}}]
[null,null,{"$f":"'1c. Inputs Segment Summary'!A11","v":"Segment J"},{"$f":"'1c. Inputs Segment Summary'!E11","v":"Poolfahrzeuge"},{"$f":"'1c. Inputs Segment Summary'!F11","v":0},{"$f":"'1c. Inputs Segment Summary'!K11","v":"Mittelklasse"},{"$f":"SUM('1c. Inputs Segment Summary'!Q11:R11)*'1c. Inputs Segment Summary'!P11","v":{"v":26000,"d":"26,000"}},{"$f":"IF('1c. Inputs Segment Summary'!J11,\"Ja\",\"Nein\")","v":"Nein"},{"$f":"'1c. Inputs Segment Summary'!V11","v":{"v":8,"d":"8.0"}},{"$f":"MAX('1c. Inputs Segment Summary'!U11*'1c. Inputs Segment Summary'!T11,0)","v":{"v":1,"d":"1.0"}}]
[]
[]
[]
[null,null,"Nötige Ladeinfrastruktur für die Flotte"]
[]
[null,null,"Ladepunkte",{"$nulls":12},"Ladepunkte nach Segment"]
[{"$nulls":3},"Anzahl","Ladeleistung (kW)","AC/DC","Energiebedarf pro Tag (kWh)",{"$nulls":9},"Wohnort",null,"Firmenstandort \n(über Nacht)",null,"Firmenstandort \n(tagsüber)"]
[null,null,"öffentlich","-","-","-",{"$f":"IF('3a. Detailierte Ergebnisse'!J31>0,'3a. Detailierte Ergebnisse'!J31,\"-\")","v":"-"},null,null,"Energiebedarf",{"$nulls":6},"Anzahl","Ladeleistung (kW)","Anzahl","Ladeleistung (kW)","Anzahl","Ladeleistung (kW)"]
[null,null,"Wohnort",{"$f":"IF('3a. Detailierte Ergebnisse'!B24=0,\"-\",'3a. Detailierte Ergebnisse'!B24)","v":"-"},{"$f":"IF(D26=\"-\",D26,'3a. Detailierte Ergebnisse'!B22)","v":"-"},{"$f":"IF(D26=\"-\",D26,INDEX(OFFSET(Ladeleistung,0,1),MATCH(E26,Ladeleistung,0)))","v":"-"},{"$f":"IF(D26=\"-\",D26,'3a. Detailierte Ergebnisse'!B25)","v":"-"},{"$nulls":8},{"$f":"'1c. Inputs Segment Summary'!A2","v":"Segment A"},{"$f":"'2a. Ladekonzept'!V5*'2a. Ladekonzept'!C5","v":0},{"$f":"IF(Q26>0,'Eingaben (Inputs)'!$J$24,0)","v":0},{"$f":"'2a. Ladekonzept'!X5*'2a. Ladekonzept'!C5","v":{"v":1,"d":"1.0"}},{"$f":"'2a. Ladekonzept'!Z5","v":11},{"$f":"'2a. Ladekonzept'!AD5*'2a. Ladekonzept'!C5","v":0},{"$f":"'2a. Ladekonzept'!AF5","v":0}]
[null,null,"Firmenstandort",{"$f":"TRANSPOSE(_xlfn.LET(_xlpm.arrkW,'3a. Detailierte Ergebnisse'!T22:AE22,_xlpm.arrN,'3a. Detailierte Ergebnisse'!T24:AE24,IF(E27=\"-\",E27,_xlfn._xlws.FILTER(_xlpm.arrN,_xlpm.arrN>0))))","v":1},{"$f":"TRANSPOSE(_xlfn.LET(_xlpm.arrkW,'3a. Detailierte Ergebnisse'!T22:AE22,_xlpm.arrN,'3a. Detailierte Ergebnisse'!T24:AE24,_xlfn._xlws.FILTER(_xlpm.arrkW,_xlpm.arrN>0,\"-\")))","v":11},{"$f":"IF(E27=\"-\",E27,INDEX(OFFSET(Ladeleistung,0,1),MATCH(_xlfn.ANCHORARRAY(E27),Ladeleistung,0)))","v":"AC"},{"$f":"TRANSPOSE(_xlfn.LET(_xlpm.arrkW,'3a. Detailierte Ergebnisse'!T22:AE22,_xlpm.arrN,'3a. Detailierte Ergebnisse'!T24:AE24,_xlpm.arrkWh,'3a. Detailierte Ergebnisse'!T25:AE25,IF(E27=\"-\",E27,_xlfn._xlws.FILTER(_xlpm.arrkWh,_xlpm.arrN>0))))","v":{"v":16.77777777777778,"d":"17"}},{"$nulls":8},{"$f":"'1c. Inputs Segment Summary'!A3","v":"Segment B"},{"$f":"'2a. Ladekonzept'!V6*'2a. Ladekonzept'!C6","v":0},{"$f":"IF(Q27>0,'Eingaben (Inputs)'!$J$24,0)","v":0},{"$f":"'2a. Ladekonzept'!X6*'2a. Ladekonzept'!C6","v":0},{"$f":"'2a. Ladekonzept'!Z6","v":0},{"$f":"'2a. Ladekonzept'!AD6*'2a. Ladekonzept'!C6","v":0},{"$f":"'2a. Ladekonzept'!AF6","v":0}]
[{"$nulls":15},{"$f":"'1c. Inputs Segment Summary'!A4","v":"Segment C"},{"$f":"'2a. Ladekonzept'!V7*'2a. Ladekonzept'!C7","v":0},{"$f":"IF(Q28>0,'Eingaben (Inputs)'!$J$24,0)","v":0},{"$f":"'2a. Ladekonzept'!X7*'2a. Ladekonzept'!C7","v":0},{"$f":"'2a. Ladekonzept'!Z7","v":0},{"$f":"'2a. Ladekonzept'!AD7*'2a. Ladekonzept'!C7","v":0},{"$f":"'2a. Ladekonzept'!AF7","v":0}]
[{"$nulls":15},{"$f":"'1c. Inputs Segment Summary'!A5","v":"Segment D"},{"$f":"'2a. Ladekonzept'!V8*'2a. Ladekonzept'!C8","v":0},{"$f":"IF(Q29>0,'Eingaben (Inputs)'!$J$24,0)","v":0},{"$f":"'2a. Ladekonzept'!X8*'2a. Ladekonzept'!C8","v":0},{"$f":"'2a. Ladekonzept'!Z8","v":0},{"$f":"'2a. Ladekonzept'!AD8*'2a. Ladekonzept'!C8","v":0},{"$f":"'2a. Ladekonzept'!AF8","v":0}]
[{"$nulls":15},{"$f":"'1c. Inputs Segment Summary'!A6","v":"Segment E"},{"$f":"'2a. Ladekonzept'!V9*'2a. Ladekonzept'!C9","v":0},{"$f":"IF(Q30>0,'Eingaben (Inputs)'!$J$24,0)","v":0},{"$f":"'2a. Ladekonzept'!X9*'2a. Ladekonzept'!C9","v":0},{"$f":"'2a. Ladekonzept'!Z9","v":0},{"$f":"'2a. Ladekonzept'!AD9*'2a. Ladekonzept'!C9","v":0},{"$f":"'2a. Ladekonzept'!AF9","v":0}]
[{"$nulls":15},{"$f":"'1c. Inputs Segment Summary'!A7","v":"Segment F"},{"$f":"'2a. Ladekonzept'!V10*'2a. Ladekonzept'!C10","v":0},{"$f":"IF(Q31>0,'Eingaben (Inputs)'!$J$24,0)","v":0},{"$f":"'2a. Ladekonzept'!X10*'2a. Ladekonzept'!C10","v":0},{"$f":"'2a. Ladekonzept'!Z10","v":0},{"$f":"'2a. Ladekonzept'!AD10*'2a. Ladekonzept'!C10","v":0},{"$f":"'2a. Ladekonzept'!AF10","v":0}]
[{"$nulls":15},{"$f":"'1c. Inputs Segment Summary'!A8","v":"Segment G"},{"$f":"'2a. Ladekonzept'!V11*'2a. Ladekonzept'!C11","v":0},{"$f":"IF(Q32>0,'Eingaben (Inputs)'!$J$24,0)","v":0},{"$f":"'2a. Ladekonzept'!X11*'2a. Ladekonzept'!C11","v":0},{"$f":"'2a. Ladekonzept'!Z11","v":0},{"$f":"'2a. Ladekonzept'!AD11*'2a. Ladekonzept'!C11","v":0},{"$f":"'2a. Ladekonzept'!AF11","v":0}]
[{"$nulls":15},{"$f":"'1c. Inputs Segment Summary'!A9","v":"Segment H"},{"$f":"'2a. Ladekonzept'!V12*'2a. Ladekonzept'!C12","v":0},{"$f":"IF(Q33>0,'Eingaben (Inputs)'!$J$24,0)","v":0},{"$f":"'2a. Ladekonzept'!X12*'2a. Ladekonzept'!C12","v":0},{"$f":"'2a. Ladekonzept'!Z12","v":0},{"$f":"'2a. Ladekonzept'!AD12*'2a. Ladekonzept'!C12","v":0},{"$f":"'2a. Ladekonzept'!AF12","v":0}]
[{"$nulls":15},{"$f":"'1c. Inputs Segment Summary'!A10","v":"Segment I"},{"$f":"'2a. Ladekonzept'!V13*'2a. Ladekonzept'!C13","v":0},{"$f":"IF(Q34>0,'Eingaben (Inputs)'!$J$24,0)","v":0},{"$f":"'2a. Ladekonzept'!X13*'2a. Ladekonzept'!C13","v":0},{"$f":"'2a. Ladekonzept'!Z13","v":0},{"$f":"'2a. Ladekonzept'!AD13*'2a. Ladekonzept'!C13","v":0},{"$f":"'2a. Ladekonzept'!AF13","v":0}]
[{"$nulls":15},{"$f":"'1c. Inputs Segment Summary'!A11","v":"Segment J"},{"$f":"'2a. Ladekonzept'!V14*'2a. Ladekonzept'!C14","v":0},{"$f":"IF(Q35>0,'Eingaben (Inputs)'!$J$24,0)","v":0},{"$f":"'2a. Ladekonzept'!X14*'2a. Ladekonzept'!C14","v":0},{"$f":"'2a. Ladekonzept'!Z14","v":0},{"$f":"'2a. Ladekonzept'!AD14*'2a. Ladekonzept'!C14","v":0},{"$f":"'2a. Ladekonzept'!AF14","v":0}]
[]
[]
[{"$nulls":15},"Bemerkung: Diese Werte können in das Werkzeug \"Kostenrechner Ladeinfrastruktur\" übertragen werden."]
[]
[null,null,"Basisinfrastruktur am Firmenstandort",{"$nulls":12},"Ladepunkte und Energiebedarf am Firmenstandort nach Leistungsklassen"]
[null,null,"Leistungserhöhung des Netzanschlusses (kVA)",null,null,{"$f":"'3a. Detailierte Ergebnisse'!C38","v":0},{"$nulls":12},"11-22 kW\nAC","22-80 kW \nDC","80-150 kW\nDC",">150 kW \nDC"]
[]
[{"$nulls":15},"Anzahl Ladepunkte",null,null,{"$f":"'3a. Detailierte Ergebnisse'!AF24","v":1},{"$f":"'3a. Detailierte Ergebnisse'!AG24","v":0},{"$f":"'3a. Detailierte Ergebnisse'!AH24","v":0},{"$f":"'3a. Detailierte Ergebnisse'!AI24","v":0}]
[{"$nulls":15},"Energiebedarf pro Jahr pro Ladepunkt (kWh)",null,null,{"$f":"IF(S43>0,'3a. Detailierte Ergebnisse'!AF26/S43,0)","v":{"v":4362.222222222222,"d":"4,362"}},{"$f":"IF(T43>0,'3a. Detailierte Ergebnisse'!AG26/T43,0)","v":0},{"$f":"IF(U43>0,'3a. Detailierte Ergebnisse'!AH26/U43,0)","v":0},{"$f":"IF(V43>0,'3a. Detailierte Ergebnisse'!AI26/V43,0)","v":0}]
[]
[]
[]
[]
[null,null,"Gesamtkosten (Total Cost of Ownership TCO) der Flotte",{"$nulls":10},"Treibhausgasemissionen der Flotte"]
[]
[null,null,"CHF / km",{"$nulls":4},"Indexierte Mehrkosten",{"$nulls":5},"g CO2-eq / km",{"$nulls":5},"Indexierte Treibhausgasemissionen"]
{"$rows_empty":15}
[null,null,"CHF",{"$nulls":10},"kg CO2-eq"]
{"$rows_empty":15}
[null,null,"Hinweis: Die Kosten sind auf Basis der Nettobarwerte berechnet und beziehen sich auf die gesamte Flotte.\nDie zentralen Annahmen basieren auf Daten aus dem Verbrauchskatalog [BFE 2025], der Studie Gesamtkosten von Personenwagen (TCO) [BFE 2023], dem Leitfaden Ladeinfrastruktur in Mietobjekten [BFE 2024], sowie auf Praxiswerten aus der eigenen Erfahrung von INFRAS und dem Schweizer Mobilitätsverband sffv.",{"$nulls":10},"Hinweis: Die Klimawirkung der Treibhausgasemissionen über den gesamten Fahrzeuglebenszyklus werden in CO2-Äquivalente (CO2-eq) umgerechnet anhand von Ökobilanzdaten aus dem Umweltrechner Verkehr von EnergieSchweiz. Die Werte beziehen sich auf die gesamte Flotte. \nDie zentralen Annahmen basieren auf Daten aus dem Verbrauchskatalog [BFE 2025], der Studie Gesamtkosten von Personenwagen (TCO) [BFE 2023], dem Leitfaden Ladeinfrastruktur in Mietobjekten [BFE 2024], sowie auf Praxiswerten aus der eigenen Erfahrung von INFRAS und dem Schweizer Mobilitätsverband sffv."]

{"sheet":"1a. Defaults Segment-Ebene","index":3,"n_rows":372,"n_cols":11,"rows_kept":372,"hidden":true}
{"$rows_empty":8}
[null,"1)",{"$f":"IF('Eingaben (Inputs)'!C9<>\"\",'Eingaben (Inputs)'!C9,\"\")","v":"Flottenstruktur"},null,{"$f":"IF('Eingaben (Inputs)'!E9<>\"\",'Eingaben (Inputs)'!E9,\"\")","v":""}]
[null,null,{"$f":"IF('Eingaben (Inputs)'!C10<>\"\",'Eingaben (Inputs)'!C10,\"\")","v":""},null,{"$f":"IF('Eingaben (Inputs)'!E10<>\"\",'Eingaben (Inputs)'!E10,\"\")","v":""}]
[null,null,{"$f":"IF('Eingaben (Inputs)'!C11<>\"\",'Eingaben (Inputs)'!C11,\"\")","v":"Flotte"},null,{"$f":"IF('Eingaben (Inputs)'!E11<>\"\",'Eingaben (Inputs)'!E11,\"\")","v":""}]
[null,null,{"$f":"IF('Eingaben (Inputs)'!C12<>\"\",'Eingaben (Inputs)'!C12,\"\")","v":"Anzahl Segmente"},null,{"$f":"IF('Eingaben (Inputs)'!E12<>\"\",'Eingaben (Inputs)'!E12,\"\")","v":""}]
[null,null,{"$f":"IF('Eingaben (Inputs)'!C13<>\"\",'Eingaben (Inputs)'!C13,\"\")","v":""},null,{"$f":"IF('Eingaben (Inputs)'!E13<>\"\",'Eingaben (Inputs)'!E13,\"\")","v":""}]
[null,null,{"$f":"IF('Eingaben (Inputs)'!C14<>\"\",'Eingaben (Inputs)'!C14,\"\")","v":""},null,{"$f":"IF('Eingaben (Inputs)'!E14<>\"\",'Eingaben (Inputs)'!E14,\"\")","v":""}]
[null,"2.1)",{"$f":"IF('Eingaben (Inputs)'!C15<>\"\",'Eingaben (Inputs)'!C15,\"\")","v":"Segment A"},null,{"$f":"IF('Eingaben (Inputs)'!E15<>\"\",'Eingaben (Inputs)'!E15,\"\")","v":""},null,null,"3)","Gesamte Flotte"]
[null,null,{"$f":"IF('Eingaben (Inputs)'!C16<>\"\",'Eingaben (Inputs)'!C16,\"\")","v":""},null,{"$f":"IF('Eingaben (Inputs)'!E16<>\"\",'Eingaben (Inputs)'!E16,\"\")","v":""}]
[null,null,{"$f":"IF('Eingaben (Inputs)'!C17<>\"\",'Eingaben (Inputs)'!C17,\"\")","v":"Segmentstruktur"},null,{"$f":"IF('Eingaben (Inputs)'!E17<>\"\",'Eingaben (Inputs)'!E17,\"\")","v":""},{"$nulls":3},"Energiekosten"]
[null,null,{"$f":"IF('Eingaben (Inputs)'!C18<>\"\",'Eingaben (Inputs)'!C18,\"\")","v":"Anzahl Fahrzeuge"},{"$f":"'Eingaben (Inputs)'!D18","v":1},{"$f":"IF('Eingaben (Inputs)'!E18<>\"\",'Eingaben (Inputs)'!E18,\"\")","v":""},{"$nulls":3},"Treibstoffkosten",{"v":1.8,"d":"1.80"},"CHF/l"]
[null,null,{"$f":"IF('Eingaben (Inputs)'!C19<>\"\",'Eingaben (Inputs)'!C19,\"\")","v":"Einsatzart"},{"$f":"'Eingaben (Inputs)'!D19","v":"Poolfahrzeuge"},{"$f":"IF('Eingaben (Inputs)'!E19<>\"\",'Eingaben (Inputs)'!E19,\"\")","v":""},{"$nulls":3},"Durchschnittliche Stromkosten Wohnort",0.24,"CHF/kWh"]
[null,null,{"$f":"IF('Eingaben (Inputs)'!C20<>\"\",'Eingaben (Inputs)'!C20,\"\")","v":"Einsatzgebiet"},{"$f":"'Eingaben (Inputs)'!D20","v":"regional"},{"$f":"IF('Eingaben (Inputs)'!E20<>\"\",'Eingaben (Inputs)'!E20,\"\")","v":""},{"$nulls":3},"Durchschnittliche Stromkosten Firmenstandort",0.24,"CHF/kWh"]
[null,null,{"$f":"IF('Eingaben (Inputs)'!C21<>\"\",'Eingaben (Inputs)'!C21,\"\")","v":"Heimlademöglichkeit"},{"$f":"INDEX(Heimladen,NOT(_xlfn.XMATCH(D19,Einsatzart)-1)+1)","v":"Nein"},{"$f":"IF('Eingaben (Inputs)'!E21<>\"\",'Eingaben (Inputs)'!E21,\"\")","v":""},{"$f":"\"Standardwert: \"&'1a. Defaults Segment-Ebene'!D21","v":"Standardwert: Nein"},null,null,"Stromkosten (öffentlich)",0.55,"CHF/kWh"]
[null,null,{"$f":"IF('Eingaben (Inputs)'!C22<>\"\",'Eingaben (Inputs)'!C22,\"\")","v":""},null,{"$f":"IF('Eingaben (Inputs)'!E22<>\"\",'Eingaben (Inputs)'!E22,\"\")","v":""}]
[null,null,{"$f":"IF('Eingaben (Inputs)'!C23<>\"\",'Eingaben (Inputs)'!C23,\"\")","v":"Fahrzeugdaten"},null,{"$f":"IF('Eingaben (Inputs)'!E23<>\"\",'Eingaben (Inputs)'!E23,\"\")","v":""},{"$nulls":3},"Ladegeräte"]
[null,null,{"$f":"IF('Eingaben (Inputs)'!C24<>\"\",'Eingaben (Inputs)'!C24,\"\")","v":"Fahrzeuggrösse"},{"$f":"'Eingaben (Inputs)'!D24","v":"Mittelklasse"},{"$f":"IF('Eingaben (Inputs)'!E24<>\"\",'Eingaben (Inputs)'!E24,\"\")","v":""},{"$nulls":3},"Max. Ladeleistung pro Ladepunkt (Wohnort)",11,"kW"]
[null,null,{"$f":"IF('Eingaben (Inputs)'!C25<>\"\",'Eingaben (Inputs)'!C25,\"\")","v":"Treibstoffverbrauch Verbrenner"},{"$f":"INDEX('2d. Annahmen'!$F$13:$F$16,_xlfn.XMATCH(D24,Grösse))","v":5.8},{"$f":"IF('Eingaben (Inputs)'!E25<>\"\",'Eingaben (Inputs)'!E25,\"\")","v":"l/100 km"},{"$f":"\"Standardwert: \"&TEXT('1a. Defaults Segment-Ebene'!D25,\"##0.0\")&\" \"&E25","v":"Standardwert: 5.8 l/100 km"},null,null,"Max. Ladeleistung pro Ladepunkt (Firmenstandort, AC)",11,"kW"]
[null,null,{"$f":"IF('Eingaben (Inputs)'!C26<>\"\",'Eingaben (Inputs)'!C26,\"\")","v":"Energieverbrauch E-Fahrzeug"},{"$f":"INDEX('2d. Annahmen'!$H$4:$H$7,_xlfn.XMATCH(D24,Grösse))","v":15.1},{"$f":"IF('Eingaben (Inputs)'!E26<>\"\",'Eingaben (Inputs)'!E26,\"\")","v":"kWh/100 km"},{"$f":"\"Standardwert: \"&TEXT('1a. Defaults Segment-Ebene'!D26,\"##0.0\")&\" \"&E26","v":"Standardwert: 15.1 kWh/100 km"},null,null,"Max. Ladeleistung pro Ladepunkt (Firmenstandort, DC)",250,"kW"]
[null,null,{"$f":"IF('Eingaben (Inputs)'!C27<>\"\",'Eingaben (Inputs)'!C27,\"\")","v":"Batteriekapazität (netto)"},{"$f":"INDEX('2d. Annahmen'!$F$4:$F$7,_xlfn.XMATCH(D24,Grösse))","v":58.625},{"$f":"IF('Eingaben (Inputs)'!E27<>\"\",'Eingaben (Inputs)'!E27,\"\")","v":"kWh"},{"$f":"\"Standardwert: \"&TEXT('1a. Defaults Segment-Ebene'!D27,\"##0.0\")&\" \"&E27","v":"Standardwert: 58.6 kWh"},null,null,"Anschlusskapazität (Firmenstandort, heute)",40,"kW"]
[null,null,{"$f":"IF('Eingaben (Inputs)'!C28<>\"\",'Eingaben (Inputs)'!C28,\"\")","v":""},null,{"$f":"IF('Eingaben (Inputs)'!E28<>\"\",'Eingaben (Inputs)'!E28,\"\")","v":""},{"$nulls":3},"Fahrzeuge pro Ladepunkt (Wohnort, AC)",1]
[null,null,{"$f":"IF('Eingaben (Inputs)'!C29<>\"\",'Eingaben (Inputs)'!C29,\"\")","v":"Fahr- und Nutzungsprofil (Angabe pro Fahrzeug)"},null,{"$f":"IF('Eingaben (Inputs)'!E29<>\"\",'Eingaben (Inputs)'!E29,\"\")","v":""},{"$nulls":3},"Fahrzeuge pro Ladepunkt (Firmenstandort, AC)",1]
[null,null,{"$f":"IF('Eingaben (Inputs)'!C30<>\"\",'Eingaben (Inputs)'!C30,\"\")","v":"Nutzungsmuster"},{"$f":"'Eingaben (Inputs)'!D30","v":"Werktagsbetrieb"},{"$f":"IF('Eingaben (Inputs)'!E30<>\"\",'Eingaben (Inputs)'!E30,\"\")","v":""}]
[null,null,{"$f":"IF('Eingaben (Inputs)'!C31<>\"\",'Eingaben (Inputs)'!C31,\"\")","v":"Anzahl Arbeitstage pro Jahr"},{"$f":"INDEX('1e. Dropdown Values'!$A$7:$D$7,_xlfn.XMATCH(D30,'1e. Dropdown Values'!$A$6:$D$6))","v":260},{"$f":"IF('Eingaben (Inputs)'!E31<>\"\",'Eingaben (Inputs)'!E31,\"\")","v":""},{"$f":"\"Standardwert: \"&TEXT('1a. Defaults Segment-Ebene'!D31,\"##0\")","v":"Standardwert: 260"}]
[null,null,{"$f":"IF('Eingaben (Inputs)'!C32<>\"\",'Eingaben (Inputs)'!C32,\"\")","v":"Fahrdistanz während der Arbeitszeit"},{"$f":"INDEX('1e. Dropdown Values'!$A$4:$D$4,_xlfn.XMATCH(D20,'1e. Dropdown Values'!$A$3:$D$3))","v":100},{"$f":"IF('Eingaben (Inputs)'!E32<>\"\",'Eingaben (Inputs)'!E32,\"\")","v":"km/Tag"},{"$f":"\"Standardwert: \"&TEXT('1a. Defaults Segment-Ebene'!D32,\"##0\")&\" \"&E32","v":"Standardwert: 100 km/Tag"}]
[null,null,{"$f":"IF('Eingaben (Inputs)'!C33<>\"\",'Eingaben (Inputs)'!C33,\"\")","v":"Pendeldistanz (Hin- und Rückfahrt)"},{"$f":"(_xlfn.XMATCH(D19,Einsatzart)-1)*30","v":0},{"$f":"IF('Eingaben (Inputs)'!E33<>\"\",'Eingaben (Inputs)'!E33,\"\")","v":"km/Tag"},{"$f":"\"Standardwert: \"&TEXT('1a. Defaults Segment-Ebene'!D33,\"##0\")&\" \"&E33","v":"Standardwert: 0 km/Tag"}]
[null,null,{"$f":"IF('Eingaben (Inputs)'!C34<>\"\",'Eingaben (Inputs)'!C34,\"\")","v":"Anzahl Einsätze pro Tag"},1,{"$f":"IF('Eingaben (Inputs)'!E34<>\"\",'Eingaben (Inputs)'!E34,\"\")","v":""},{"$f":"\"Standardwert: \"&TEXT('1a. Defaults Segment-Ebene'!D34,\"##0\")","v":"Standardwert: 1"}]
[null,null,{"$f":"IF('Eingaben (Inputs)'!C35<>\"\",'Eingaben (Inputs)'!C35,\"\")","v":"Anzahl Pausen pro Tag"},null,{"$f":"IF('Eingaben (Inputs)'!E35<>\"\",'Eingaben (Inputs)'!E35,\"\")","v":""}]
[null,null,{"$f":"IF('Eingaben (Inputs)'!C36<>\"\",'Eingaben (Inputs)'!C36,\"\")","v":"Standzeit pro Pause am Firmenstandort"},{"$f":"INDEX('1e. Dropdown Values'!$A$9:$D$9,_xlfn.XMATCH(D30,'1e. Dropdown Values'!$A$6:$D$6))","v":1},{"$f":"IF('Eingaben (Inputs)'!E36<>\"\",'Eingaben (Inputs)'!E36,\"\")","v":"Stunden"},{"$f":"\"Standardwert: \"&TEXT('1a. Defaults Segment-Ebene'!D36,\"##0\")&\" \"&IF(D36=1,\"Stunde\",E36)","v":"Standardwert: 1 Stunde"}]
[null,null,{"$f":"IF('Eingaben (Inputs)'!C37<>\"\",'Eingaben (Inputs)'!C37,\"\")","v":"Standzeit über Nacht"},{"$f":"INDEX('1e. Dropdown Values'!$A$8:$D$8,_xlfn.XMATCH(D30,'1e. Dropdown Values'!$A$6:$D$6))","v":8},{"$f":"IF('Eingaben (Inputs)'!E37<>\"\",'Eingaben (Inputs)'!E37,\"\")","v":"Stunden"},{"$f":"\"Standardwert: \"&TEXT('1a. Defaults Segment-Ebene'!D37,\"##0\")&\" \"&IF(D37=1,\"Stunde\",E37)","v":"Standardwert: 8 Stunden"}]
[null,null,{"$f":"IF('Eingaben (Inputs)'!C38<>\"\",'Eingaben (Inputs)'!C38,\"\")","v":"Fahrzeuge pro Ladepunkt, Firmenstandort (tagsüber)"},{"$f":"INDEX('1e. Dropdown Values'!$B$10:$D$10,_xlfn.XMATCH(D30,Nutzungsmuster))","v":1},{"$f":"IF('Eingaben (Inputs)'!E38<>\"\",'Eingaben (Inputs)'!E38,\"\")","v":""},{"$f":"\"Standardwert: \"&TEXT('1a. Defaults Segment-Ebene'!D38,\"##0\")","v":"Standardwert: 1"}]
[null,null,{"$f":"IF('Eingaben (Inputs)'!C39<>\"\",'Eingaben (Inputs)'!C39,\"\")","v":""},null,{"$f":"IF('Eingaben (Inputs)'!E39<>\"\",'Eingaben (Inputs)'!E39,\"\")","v":""}]
[null,null,{"$f":"IF('Eingaben (Inputs)'!C40<>\"\",'Eingaben (Inputs)'!C40,\"\")","v":"Kosten (Angabe pro Fahrzeug)"},null,{"$f":"IF('Eingaben (Inputs)'!E40<>\"\",'Eingaben (Inputs)'!E40,\"\")","v":""}]
[null,null,{"$f":"IF('Eingaben (Inputs)'!C41<>\"\",'Eingaben (Inputs)'!C41,\"\")","v":"Laufzeit"},{"$f":"'Eingaben (Inputs)'!D41","v":48},{"$f":"IF('Eingaben (Inputs)'!E41<>\"\",'Eingaben (Inputs)'!E41,\"\")","v":"Monate"}]
[null,null,{"$f":"IF('Eingaben (Inputs)'!C42<>\"\",'Eingaben (Inputs)'!C42,\"\")","v":"Leasing-Zinssatz"},{"v":0.03,"d":"3.0%"},{"$f":"IF('Eingaben (Inputs)'!E42<>\"\",'Eingaben (Inputs)'!E42,\"\")","v":""},{"$f":"\"Standardwert: \"&TEXT('1a. Defaults Segment-Ebene'!D42,\"##0.0%\")","v":"Standardwert: 3.0%"}]
[null,null,{"$f":"IF('Eingaben (Inputs)'!C43<>\"\",'Eingaben (Inputs)'!C43,\"\")","v":"Anschaffungspreis inkl. Flottenrabatt Verbrenner"},{"$f":"INDEX('2d. Annahmen'!$H$13:$H$16,_xlfn.XMATCH(D24,'2d. Annahmen'!$B$4:$B$7))*(1-'2d. Annahmen'!$B$30)","v":{"v":27219.464999999997,"d":"27,219"}},{"$f":"IF('Eingaben (Inputs)'!E43<>\"\",'Eingaben (Inputs)'!E43,\"\")","v":"CHF"},{"$f":"\"Standardwert: \"&TEXT('1a. Defaults Segment-Ebene'!D43,\"#’##0\")&\" \"&E43","v":"Standardwert: 27’219 CHF"}]
[null,null,{"$f":"IF('Eingaben (Inputs)'!C44<>\"\",'Eingaben (Inputs)'!C44,\"\")","v":"Service- und Reparaturkosten Verbrenner"},{"$f":"INDEX('2d. Annahmen'!$J$13:$J$16,_xlfn.XMATCH(D24,Grösse))/20000","v":0.05},{"$f":"IF('Eingaben (Inputs)'!E44<>\"\",'Eingaben (Inputs)'!E44,\"\")","v":"CHF/km"},{"$f":"\"Standardwert: \"&TEXT('1a. Defaults Segment-Ebene'!D44,\"##0.000\")&\" \"&E44","v":"Standardwert: 0.050 CHF/km"}]
[null,null,{"$f":"IF('Eingaben (Inputs)'!C45<>\"\",'Eingaben (Inputs)'!C45,\"\")","v":"Restwert Verbrenner"},{"$f":"_xlfn.LET(_xlpm.class,D24,_xlpm.km,ROUNDUP(D31*IF(D18=INDEX(Einsatzart,1),D32,D32+D33)*D41/12/5000,0)*5000,_xlpm.lz,D41,_xlpm.totkm,'2d. Annahmen'!$B$76:$G$76,_xlpm.totlz,'2d. Annahmen'!$A$77:$A$82,_xlpm.rkm,MIN(MAX(_xlpm.km,MIN(_xlpm.totkm)),MAX(_xlpm.totkm)),_xlpm.r,_xlfn.XMATCH(_xlpm.lz,_xlpm.totlz),_xlpm.c,_xlfn.XMATCH(_xlpm.rkm,_xlpm.totkm),_xlpm.delta,1+INDEX('2d. Annahmen'!$K$13:$K$16,_xlfn.XMATCH(_xlpm.class,Grösse)),_xlpm.delta*INDEX('2d. Annahmen'!$B$77:$G$82,_xlpm.r,_xlpm.c))","v":{"v":0.31606388888888887,"d":"32%"}},{"$f":"IF('Eingaben (Inputs)'!E45<>\"\",'Eingaben (Inputs)'!E45,\"\")","v":""},{"$f":"\"Standardwert: \"&TEXT('1a. Defaults Segment-Ebene'!D45,\"##0.0%\")","v":"Standardwert: 31.6%"}]
[null,null,{"$f":"IF('Eingaben (Inputs)'!C46<>\"\",'Eingaben (Inputs)'!C46,\"\")","v":"Anschaffungspreis inkl. Flottenrabatt E-Fahrzeug"},{"$f":"INDEX('2d. Annahmen'!$K$4:$K$7,_xlfn.XMATCH(D24,'2d. Annahmen'!$B$4:$B$7))*(1-'2d. Annahmen'!$B$29)","v":{"v":28810.890000000003,"d":"28,811"}},{"$f":"IF('Eingaben (Inputs)'!E46<>\"\",'Eingaben (Inputs)'!E46,\"\")","v":"CHF"},{"$f":"\"Standardwert: \"&TEXT('1a. Defaults Segment-Ebene'!D46,\"#’##0\")&\" \"&E46","v":"Standardwert: 28’811 CHF"}]
[null,null,{"$f":"IF('Eingaben (Inputs)'!C47<>\"\",'Eingaben (Inputs)'!C47,\"\")","v":"Service- und Reparaturkosten E-Fahrzeug"},{"$f":"D44*0.5","v":0.025},{"$f":"IF('Eingaben (Inputs)'!E47<>\"\",'Eingaben (Inputs)'!E47,\"\")","v":"CHF/km"},{"$f":"\"Standardwert: \"&TEXT('1a. Defaults Segment-Ebene'!D47,\"0.000\")&\" \"&E47","v":"Standardwert: 0.025 CHF/km"}]
[null,null,{"$f":"IF('Eingaben (Inputs)'!C48<>\"\",'Eingaben (Inputs)'!C48,\"\")","v":"Restwert E-Fahrzeug"},{"$f":"_xlfn.LET(_xlpm.class,D24,_xlpm.km,ROUNDUP(D31*IF(D18=INDEX(Einsatzart,1),D32,D32+D33)*D41/12/5000,0)*5000,_xlpm.lz,D41,_xlpm.totkm,'2d. Annahmen'!$B$76:$G$76,_xlpm.totlz,'2d. Annahmen'!$A$77:$A$82,_xlpm.rkm,MIN(MAX(_xlpm.km,MIN(_xlpm.totkm)),MAX(_xlpm.totkm)),_xlpm.r,_xlfn.XMATCH(_xlpm.lz,_xlpm.totlz),_xlpm.c,_xlfn.XMATCH(_xlpm.rkm,_xlpm.totkm),_xlpm.delta,1+INDEX('2d. Annahmen'!$N$4:$N$7,_xlfn.XMATCH(_xlpm.class,Grösse)),_xlpm.delta*INDEX('2d. Annahmen'!$B$77:$G$82,_xlpm.r,_xlpm.c))","v":{"v":0.30658197222222217,"d":"31%"}},{"$f":"IF('Eingaben (Inputs)'!E48<>\"\",'Eingaben (Inputs)'!E48,\"\")","v":""},{"$f":"\"Standardwert: \"&TEXT('1a. Defaults Segment-Ebene'!D48,\"##0.0%\")","v":"Standardwert: 30.7%"}]
[null,null,{"$f":"IF('Eingaben (Inputs)'!C49<>\"\",'Eingaben (Inputs)'!C49,\"\")","v":""},null,{"$f":"IF('Eingaben (Inputs)'!E49<>\"\",'Eingaben (Inputs)'!E49,\"\")","v":""}]
[null,null,{"$f":"IF('Eingaben (Inputs)'!C50<>\"\",'Eingaben (Inputs)'!C50,\"\")","v":""},null,{"$f":"IF('Eingaben (Inputs)'!E50<>\"\",'Eingaben (Inputs)'!E50,\"\")","v":""}]
[null,"2.2)",{"$f":"IF('Eingaben (Inputs)'!C51<>\"\",'Eingaben (Inputs)'!C51,\"\")","v":"Segment B"},null,{"$f":"IF('Eingaben (Inputs)'!E51<>\"\",'Eingaben (Inputs)'!E51,\"\")","v":""}]
[null,null,{"$f":"IF('Eingaben (Inputs)'!C52<>\"\",'Eingaben (Inputs)'!C52,\"\")","v":""},null,{"$f":"IF('Eingaben (Inputs)'!E52<>\"\",'Eingaben (Inputs)'!E52,\"\")","v":""}]
[null,null,{"$f":"IF('Eingaben (Inputs)'!C53<>\"\",'Eingaben (Inputs)'!C53,\"\")","v":"Segmentstruktur"},null,{"$f":"IF('Eingaben (Inputs)'!E53<>\"\",'Eingaben (Inputs)'!E53,\"\")","v":""}]
[null,null,{"$f":"IF('Eingaben (Inputs)'!C54<>\"\",'Eingaben (Inputs)'!C54,\"\")","v":"Anzahl Fahrzeuge"},{"$f":"'Eingaben (Inputs)'!D54","v":1},{"$f":"IF('Eingaben (Inputs)'!E54<>\"\",'Eingaben (Inputs)'!E54,\"\")","v":""}]
[null,null,{"$f":"IF('Eingaben (Inputs)'!C55<>\"\",'Eingaben (Inputs)'!C55,\"\")","v":"Einsatzart"},{"$f":"'Eingaben (Inputs)'!D55","v":"Poolfahrzeuge"},{"$f":"IF('Eingaben (Inputs)'!E55<>\"\",'Eingaben (Inputs)'!E55,\"\")","v":""}]
[null,null,{"$f":"IF('Eingaben (Inputs)'!C56<>\"\",'Eingaben (Inputs)'!C56,\"\")","v":"Einsatzgebiet"},{"$f":"'Eingaben (Inputs)'!D56","v":"regional"},{"$f":"IF('Eingaben (Inputs)'!E56<>\"\",'Eingaben (Inputs)'!E56,\"\")","v":""}]
[null,null,{"$f":"IF('Eingaben (Inputs)'!C57<>\"\",'Eingaben (Inputs)'!C57,\"\")","v":"Heimlademöglichkeit"},{"$f":"INDEX(Heimladen,NOT(_xlfn.XMATCH(D55,Einsatzart)-1)+1)","v":"Nein"},{"$f":"IF('Eingaben (Inputs)'!E57<>\"\",'Eingaben (Inputs)'!E57,\"\")","v":""},{"$f":"\"Standardwert: \"&'1a. Defaults Segment-Ebene'!D57","v":"Standardwert: Nein"}]
[null,null,{"$f":"IF('Eingaben (Inputs)'!C58<>\"\",'Eingaben (Inputs)'!C58,\"\")","v":""},null,{"$f":"IF('Eingaben (Inputs)'!E58<>\"\",'Eingaben (Inputs)'!E58,\"\")","v":""}]
[null,null,{"$f":"IF('Eingaben (Inputs)'!C59<>\"\",'Eingaben (Inputs)'!C59,\"\")","v":"Fahrzeugdaten"},null,{"$f":"IF('Eingaben (Inputs)'!E59<>\"\",'Eingaben (Inputs)'!E59,\"\")","v":""}]
[null,null,{"$f":"IF('Eingaben (Inputs)'!C60<>\"\",'Eingaben (Inputs)'!C60,\"\")","v":"Fahrzeuggrösse"},{"$f":"'Eingaben (Inputs)'!D60","v":"Mittelklasse"},{"$f":"IF('Eingaben (Inputs)'!E60<>\"\",'Eingaben (Inputs)'!E60,\"\")","v":""}]
[null,null,{"$f":"IF('Eingaben (Inputs)'!C61<>\"\",'Eingaben (Inputs)'!C61,\"\")","v":"Treibstoffverbrauch Verbrenner"},{"$f":"INDEX('2d. Annahmen'!$F$13:$F$16,_xlfn.XMATCH(D60,Grösse))","v":5.8},{"$f":"IF('Eingaben (Inputs)'!E61<>\"\",'Eingaben (Inputs)'!E61,\"\")","v":"l/100 km"},{"$f":"\"Standardwert: \"&TEXT('1a. Defaults Segment-Ebene'!D61,\"##0.0\")&\" \"&E61","v":"Standardwert: 5.8 l/100 km"}]
[null,null,{"$f":"IF('Eingaben (Inputs)'!C62<>\"\",'Eingaben (Inputs)'!C62,\"\")","v":"Energieverbrauch E-Fahrzeug"},{"$f":"INDEX('2d. Annahmen'!$H$4:$H$7,_xlfn.XMATCH(D60,Grösse))","v":15.1},{"$f":"IF('Eingaben (Inputs)'!E62<>\"\",'Eingaben (Inputs)'!E62,\"\")","v":"kWh/100 km"},{"$f":"\"Standardwert: \"&TEXT('1a. Defaults Segment-Ebene'!D62,\"##0.0\")&\" \"&E62","v":"Standardwert: 15.1 kWh/100 km"}]
[null,null,{"$f":"IF('Eingaben (Inputs)'!C63<>\"\",'Eingaben (Inputs)'!C63,\"\")","v":"Batteriekapazität (netto)"},{"$f":"INDEX('2d. Annahmen'!$F$4:$F$7,_xlfn.XMATCH(D60,Grösse))","v":58.625},{"$f":"IF('Eingaben (Inputs)'!E63<>\"\",'Eingaben (Inputs)'!E63,\"\")","v":"kWh"},{"$f":"\"Standardwert: \"&TEXT('1a. Defaults Segment-Ebene'!D63,\"##0.0\")&\" \"&E63","v":"Standardwert: 58.6 kWh"}]
[null,null,{"$f":"IF('Eingaben (Inputs)'!C64<>\"\",'Eingaben (Inputs)'!C64,\"\")","v":""},null,{"$f":"IF('Eingaben (Inputs)'!E64<>\"\",'Eingaben (Inputs)'!E64,\"\")","v":""}]
[null,null,{"$f":"IF('Eingaben (Inputs)'!C65<>\"\",'Eingaben (Inputs)'!C65,\"\")","v":"Fahr- und Nutzungsprofil (Angabe pro Fahrzeug)"},null,{"$f":"IF('Eingaben (Inputs)'!E65<>\"\",'Eingaben (Inputs)'!E65,\"\")","v":""}]
[null,null,{"$f":"IF('Eingaben (Inputs)'!C66<>\"\",'Eingaben (Inputs)'!C66,\"\")","v":"Nutzungsmuster"},{"$f":"'Eingaben (Inputs)'!D66","v":"Werktagsbetrieb"},{"$f":"IF('Eingaben (Inputs)'!E66<>\"\",'Eingaben (Inputs)'!E66,\"\")","v":""}]
[null,null,{"$f":"IF('Eingaben (Inputs)'!C67<>\"\",'Eingaben (Inputs)'!C67,\"\")","v":"Anzahl Arbeitstage pro Jahr"},{"$f":"INDEX('1e. Dropdown Values'!$A$7:$D$7,_xlfn.XMATCH(D66,'1e. Dropdown Values'!$A$6:$D$6))","v":260},{"$f":"IF('Eingaben (Inputs)'!E67<>\"\",'Eingaben (Inputs)'!E67,\"\")","v":""},{"$f":"\"Standardwert: \"&TEXT('1a. Defaults Segment-Ebene'!D67,\"##0\")","v":"Standardwert: 260"}]
[null,null,{"$f":"IF('Eingaben (Inputs)'!C68<>\"\",'Eingaben (Inputs)'!C68,\"\")","v":"Fahrdistanz während der Arbeitszeit"},{"$f":"INDEX('1e. Dropdown Values'!$A$4:$D$4,_xlfn.XMATCH(D56,'1e. Dropdown Values'!$A$3:$D$3))","v":100},{"$f":"IF('Eingaben (Inputs)'!E68<>\"\",'Eingaben (Inputs)'!E68,\"\")","v":"km/Tag"},{"$f":"\"Standardwert: \"&TEXT('1a. Defaults Segment-Ebene'!D68,\"##0\")&\" \"&E68","v":"Standardwert: 100 km/Tag"}]
[null,null,{"$f":"IF('Eingaben (Inputs)'!C69<>\"\",'Eingaben (Inputs)'!C69,\"\")","v":"Pendeldistanz (Hin- und Rückfahrt)"},{"$f":"(_xlfn.XMATCH(D55,Einsatzart)-1)*30","v":0},{"$f":"IF('Eingaben (Inputs)'!E69<>\"\",'Eingaben (Inputs)'!E69,\"\")","v":"km/Tag"},{"$f":"\"Standardwert: \"&TEXT('1a. Defaults Segment-Ebene'!D69,\"##0\")&\" \"&E69","v":"Standardwert: 0 km/Tag"}]
[null,null,{"$f":"IF('Eingaben (Inputs)'!C70<>\"\",'Eingaben (Inputs)'!C70,\"\")","v":"Anzahl Einsätze pro Tag"},1,{"$f":"IF('Eingaben (Inputs)'!E70<>\"\",'Eingaben (Inputs)'!E70,\"\")","v":""},{"$f":"\"Standardwert: \"&TEXT('1a. Defaults Segment-Ebene'!D70,\"##0\")","v":"Standardwert: 1"}]
[null,null,{"$f":"IF('Eingaben (Inputs)'!C71<>\"\",'Eingaben (Inputs)'!C71,\"\")","v":"Anzahl Pausen pro Tag"},null,{"$f":"IF('Eingaben (Inputs)'!E71<>\"\",'Eingaben (Inputs)'!E71,\"\")","v":""}]
[null,null,{"$f":"IF('Eingaben (Inputs)'!C72<>\"\",'Eingaben (Inputs)'!C72,\"\")","v":"Standzeit pro Pause am Firmenstandort"},{"$f":"INDEX('1e. Dropdown Values'!$A$9:$D$9,_xlfn.XMATCH(D66,'1e. Dropdown Values'!$A$6:$D$6))","v":1},{"$f":"IF('Eingaben (Inputs)'!E72<>\"\",'Eingaben (Inputs)'!E72,\"\")","v":"Stunden"},{"$f":"\"Standardwert: \"&TEXT('1a. Defaults Segment-Ebene'!D72,\"##0\")&\" \"&IF(D72=1,\"Stunde\",E72)","v":"Standardwert: 1 Stunde"}]
[null,null,{"$f":"IF('Eingaben (Inputs)'!C73<>\"\",'Eingaben (Inputs)'!C73,\"\")","v":"Standzeit über Nacht"},{"$f":"INDEX('1e. Dropdown Values'!$A$8:$D$8,_xlfn.XMATCH(D66,'1e. Dropdown Values'!$A$6:$D$6))","v":8},{"$f":"IF('Eingaben (Inputs)'!E73<>\"\",'Eingaben (Inputs)'!E73,\"\")","v":"Stunden"},{"$f":"\"Standardwert: \"&TEXT('1a. Defaults Segment-Ebene'!D73,\"##0\")&\" \"&IF(D73=1,\"Stunde\",E73)","v":"Standardwert: 8 Stunden"}]
[null,null,{"$f":"IF('Eingaben (Inputs)'!C74<>\"\",'Eingaben (Inputs)'!C74,\"\")","v":"Fahrzeuge pro Ladepunkt, Firmenstandort (tagsüber)"},{"$f":"INDEX('1e. Dropdown Values'!$B$10:$D$10,_xlfn.XMATCH(D66,Nutzungsmuster))","v":1},{"$f":"IF('Eingaben (Inputs)'!E74<>\"\",'Eingaben (Inputs)'!E74,\"\")","v":""},{"$f":"\"Standardwert: \"&TEXT('1a. Defaults Segment-Ebene'!D74,\"##0\")","v":"Standardwert: 1"}]
[null,null,{"$f":"IF('Eingaben (Inputs)'!C75<>\"\",'Eingaben (Inputs)'!C75,\"\")","v":""},null,{"$f":"IF('Eingaben (Inputs)'!E75<>\"\",'Eingaben (Inputs)'!E75,\"\")","v":""}]
[null,null,{"$f":"IF('Eingaben (Inputs)'!C76<>\"\",'Eingaben (Inputs)'!C76,\"\")","v":"Kosten (Angabe pro Fahrzeug)"},null,{"$f":"IF('Eingaben (Inputs)'!E76<>\"\",'Eingaben (Inputs)'!E76,\"\")","v":""}]
[null,null,{"$f":"IF('Eingaben (Inputs)'!C77<>\"\",'Eingaben (Inputs)'!C77,\"\")","v":"Laufzeit"},{"$f":"'Eingaben (Inputs)'!D77","v":48},{"$f":"IF('Eingaben (Inputs)'!E77<>\"\",'Eingaben (Inputs)'!E77,\"\")","v":"Monate"}]
[null,null,{"$f":"IF('Eingaben (Inputs)'!C78<>\"\",'Eingaben (Inputs)'!C78,\"\")","v":"Leasing-Zinssatz"},{"v":0.03,"d":"3.0%"},{"$f":"IF('Eingaben (Inputs)'!E78<>\"\",'Eingaben (Inputs)'!E78,\"\")","v":""},{"$f":"\"Standardwert: \"&TEXT('1a. Defaults Segment-Ebene'!D78,\"##0.0%\")","v":"Standardwert: 3.0%"}]
[null,null,{"$f":"IF('Eingaben (Inputs)'!C79<>\"\",'Eingaben (Inputs)'!C79,\"\")","v":"Anschaffungspreis inkl. Flottenrabatt Verbrenner"},{"$f":"INDEX('2d. Annahmen'!$H$13:$H$16,_xlfn.XMATCH(D60,'2d. Annahmen'!$B$4:$B$7))*(1-'2d. Annahmen'!$B$30)","v":{"v":27219.464999999997,"d":"27,219"}},{"$f":"IF('Eingaben (Inputs)'!E79<>\"\",'Eingaben (Inputs)'!E79,\"\")","v":"CHF"},{"$f":"\"Standardwert: \"&TEXT('1a. Defaults Segment-Ebene'!D79,\"#’##0\")&\" \"&E79","v":"Standardwert: 27’219 CHF"}]
[null,null,{"$f":"IF('Eingaben (Inputs)'!C80<>\"\",'Eingaben (Inputs)'!C80,\"\")","v":"Service- und Reparaturkosten Verbrenner"},{"$f":"INDEX('2d. Annahmen'!$J$13:$J$16,_xlfn.XMATCH(D60,Grösse))/20000","v":0.05},{"$f":"IF('Eingaben (Inputs)'!E80<>\"\",'Eingaben (Inputs)'!E80,\"\")","v":"CHF/km"},{"$f":"\"Standardwert: \"&TEXT('1a. Defaults Segment-Ebene'!D80,\"##0.000\")&\" \"&E80","v":"Standardwert: 0.050 CHF/km"}]
[null,null,{"$f":"IF('Eingaben (Inputs)'!C81<>\"\",'Eingaben (Inputs)'!C81,\"\")","v":"Restwert Verbrenner"},{"$f":"_xlfn.LET(_xlpm.class,D60,_xlpm.km,ROUNDUP(D67*IF(D54=INDEX(Einsatzart,1),D68,D68+D69)*D77/12/5000,0)*5000,_xlpm.lz,D77,_xlpm.totkm,'2d. Annahmen'!$B$76:$G$76,_xlpm.totlz,'2d. Annahmen'!$A$77:$A$82,_xlpm.rkm,MIN(MAX(_xlpm.km,MIN(_xlpm.totkm)),MAX(_xlpm.totkm)),_xlpm.r,_xlfn.XMATCH(_xlpm.lz,_xlpm.totlz),_xlpm.c,_xlfn.XMATCH(_xlpm.rkm,_xlpm.totkm),_xlpm.delta,1+INDEX('2d. Annahmen'!$K$13:$K$16,_xlfn.XMATCH(_xlpm.class,Grösse)),_xlpm.delta*INDEX('2d. Annahmen'!$B$77:$G$82,_xlpm.r,_xlpm.c))","v":{"v":0.31606388888888887,"d":"32%"}},{"$f":"IF('Eingaben (Inputs)'!E81<>\"\",'Eingaben (Inputs)'!E81,\"\")","v":""},{"$f":"\"Standardwert: \"&TEXT('1a. Defaults Segment-Ebene'!D81,\"##0.0%\")","v":"Standardwert: 31.6%"}]
[null,null,{"$f":"IF('Eingaben (Inputs)'!C82<>\"\",'Eingaben (Inputs)'!C82,\"\")","v":"Anschaffungspreis inkl. Flottenrabatt E-Fahrzeug"},{"$f":"INDEX('2d. Annahmen'!$K$4:$K$7,_xlfn.XMATCH(D60,'2d. Annahmen'!$B$4:$B$7))*(1-'2d. Annahmen'!$B$29)","v":{"v":28810.890000000003,"d":"28,811"}},{"$f":"IF('Eingaben (Inputs)'!E82<>\"\",'Eingaben (Inputs)'!E82,\"\")","v":"CHF"},{"$f":"\"Standardwert: \"&TEXT('1a. Defaults Segment-Ebene'!D82,\"#’##0\")&\" \"&E82","v":"Standardwert: 28’811 CHF"}]
[null,null,{"$f":"IF('Eingaben (Inputs)'!C83<>\"\",'Eingaben (Inputs)'!C83,\"\")","v":"Service- und Reparaturkosten E-Fahrzeug"},{"$f":"D80*0.5","v":0.025},{"$f":"IF('Eingaben (Inputs)'!E83<>\"\",'Eingaben (Inputs)'!E83,\"\")","v":"CHF/km"},{"$f":"\"Standardwert: \"&TEXT('1a. Defaults Segment-Ebene'!D83,\"0.000\")&\" \"&E83","v":"Standardwert: 0.025 CHF/km"}]
[null,null,{"$f":"IF('Eingaben (Inputs)'!C84<>\"\",'Eingaben (Inputs)'!C84,\"\")","v":"Restwert E-Fahrzeug"},{"$f":"_xlfn.LET(_xlpm.class,D60,_xlpm.km,ROUNDUP(D67*IF(D54=INDEX(Einsatzart,1),D68,D68+D69)*D77/12/5000,0)*5000,_xlpm.lz,D77,_xlpm.totkm,'2d. Annahmen'!$B$76:$G$76,_xlpm.totlz,'2d. Annahmen'!$A$77:$A$82,_xlpm.rkm,MIN(MAX(_xlpm.km,MIN(_xlpm.totkm)),MAX(_xlpm.totkm)),_xlpm.r,_xlfn.XMATCH(_xlpm.lz,_xlpm.totlz),_xlpm.c,_xlfn.XMATCH(_xlpm.rkm,_xlpm.totkm),_xlpm.delta,1+INDEX('2d. Annahmen'!$N$4:$N$7,_xlfn.XMATCH(_xlpm.class,Grösse)),_xlpm.delta*INDEX('2d. Annahmen'!$B$77:$G$82,_xlpm.r,_xlpm.c))","v":{"v":0.30658197222222217,"d":"31%"}},{"$f":"IF('Eingaben (Inputs)'!E84<>\"\",'Eingaben (Inputs)'!E84,\"\")","v":""},{"$f":"\"Standardwert: \"&TEXT('1a. Defaults Segment-Ebene'!D84,\"##0.0%\")","v":"Standardwert: 30.7%"}]
[null,null,{"$f":"IF('Eingaben (Inputs)'!C85<>\"\",'Eingaben (Inputs)'!C85,\"\")","v":""},null,{"$f":"IF('Eingaben (Inputs)'!E85<>\"\",'Eingaben (Inputs)'!E85,\"\")","v":""}]
[null,null,{"$f":"IF('Eingaben (Inputs)'!C86<>\"\",'Eingaben (Inputs)'!C86,\"\")","v":""},null,{"$f":"IF('Eingaben (Inputs)'!E86<>\"\",'Eingaben (Inputs)'!E86,\"\")","v":""}]
[null,"2.3)",{"$f":"IF('Eingaben (Inputs)'!C87<>\"\",'Eingaben (Inputs)'!C87,\"\")","v":"Segment C"},null,{"$f":"IF('Eingaben (Inputs)'!E87<>\"\",'Eingaben (Inputs)'!E87,\"\")","v":""}]
[null,null,{"$f":"IF('Eingaben (Inputs)'!C88<>\"\",'Eingaben (Inputs)'!C88,\"\")","v":""},null,{"$f":"IF('Eingaben (Inputs)'!E88<>\"\",'Eingaben (Inputs)'!E88,\"\")","v":""}]
[null,null,{"$f":"IF('Eingaben (Inputs)'!C89<>\"\",'Eingaben (Inputs)'!C89,\"\")","v":"Segmentstruktur"},null,{"$f":"IF('Eingaben (Inputs)'!E89<>\"\",'Eingaben (Inputs)'!E89,\"\")","v":""}]
[null,null,{"$f":"IF('Eingaben (Inputs)'!C90<>\"\",'Eingaben (Inputs)'!C90,\"\")","v":"Anzahl Fahrzeuge"},{"$f":"'Eingaben (Inputs)'!D90","v":1},{"$f":"IF('Eingaben (Inputs)'!E90<>\"\",'Eingaben (Inputs)'!E90,\"\")","v":""}]
[null,null,{"$f":"IF('Eingaben (Inputs)'!C91<>\"\",'Eingaben (Inputs)'!C91,\"\")","v":"Einsatzart"},{"$f":"'Eingaben (Inputs)'!D91","v":"Poolfahrzeuge"},{"$f":"IF('Eingaben (Inputs)'!E91<>\"\",'Eingaben (Inputs)'!E91,\"\")","v":""}]
[null,null,{"$f":"IF('Eingaben (Inputs)'!C92<>\"\",'Eingaben (Inputs)'!C92,\"\")","v":"Einsatzgebiet"},{"$f":"'Eingaben (Inputs)'!D92","v":"regional"},{"$f":"IF('Eingaben (Inputs)'!E92<>\"\",'Eingaben (Inputs)'!E92,\"\")","v":""}]
[null,null,{"$f":"IF('Eingaben (Inputs)'!C93<>\"\",'Eingaben (Inputs)'!C93,\"\")","v":"Heimlademöglichkeit"},{"$f":"INDEX(Heimladen,NOT(_xlfn.XMATCH(D91,Einsatzart)-1)+1)","v":"Nein"},{"$f":"IF('Eingaben (Inputs)'!E93<>\"\",'Eingaben (Inputs)'!E93,\"\")","v":""},{"$f":"\"Standardwert: \"&'1a. Defaults Segment-Ebene'!D93","v":"Standardwert: Nein"}]
[null,null,{"$f":"IF('Eingaben (Inputs)'!C94<>\"\",'Eingaben (Inputs)'!C94,\"\")","v":""},null,{"$f":"IF('Eingaben (Inputs)'!E94<>\"\",'Eingaben (Inputs)'!E94,\"\")","v":""}]
[null,null,{"$f":"IF('Eingaben (Inputs)'!C95<>\"\",'Eingaben (Inputs)'!C95,\"\")","v":"Fahrzeugdaten"},null,{"$f":"IF('Eingaben (Inputs)'!E95<>\"\",'Eingaben (Inputs)'!E95,\"\")","v":""}]
[null,null,{"$f":"IF('Eingaben (Inputs)'!C96<>\"\",'Eingaben (Inputs)'!C96,\"\")","v":"Fahrzeuggrösse"},{"$f":"'Eingaben (Inputs)'!D96","v":"Mittelklasse"},{"$f":"IF('Eingaben (Inputs)'!E96<>\"\",'Eingaben (Inputs)'!E96,\"\")","v":""}]
[null,null,{"$f":"IF('Eingaben (Inputs)'!C97<>\"\",'Eingaben (Inputs)'!C97,\"\")","v":"Treibstoffverbrauch Verbrenner"},{"$f":"INDEX('2d. Annahmen'!$F$13:$F$16,_xlfn.XMATCH(D96,Grösse))","v":5.8},{"$f":"IF('Eingaben (Inputs)'!E97<>\"\",'Eingaben (Inputs)'!E97,\"\")","v":"l/100 km"},{"$f":"\"Standardwert: \"&TEXT('1a. Defaults Segment-Ebene'!D97,\"##0.0\")&\" \"&E97","v":"Standardwert: 5.8 l/100 km"}]
[null,null,{"$f":"IF('Eingaben (Inputs)'!C98<>\"\",'Eingaben (Inputs)'!C98,\"\")","v":"Energieverbrauch E-Fahrzeug"},{"$f":"INDEX('2d. Annahmen'!$H$4:$H$7,_xlfn.XMATCH(D96,Grösse))","v":15.1},{"$f":"IF('Eingaben (Inputs)'!E98<>\"\",'Eingaben (Inputs)'!E98,\"\")","v":"kWh/100 km"},{"$f":"\"Standardwert: \"&TEXT('1a. Defaults Segment-Ebene'!D98,\"##0.0\")&\" \"&E98","v":"Standardwert: 15.1 kWh/100 km"}]
[null,null,{"$f":"IF('Eingaben (Inputs)'!C99<>\"\",'Eingaben (Inputs)'!C99,\"\")","v":"Batteriekapazität (netto)"},{"$f":"INDEX('2d. Annahmen'!$F$4:$F$7,_xlfn.XMATCH(D96,Grösse))","v":58.625},{"$f":"IF('Eingaben (Inputs)'!E99<>\"\",'Eingaben (Inputs)'!E99,\"\")","v":"kWh"},{"$f":"\"Standardwert: \"&TEXT('1a. Defaults Segment-Ebene'!D99,\"##0.0\")&\" \"&E99","v":"Standardwert: 58.6 kWh"}]
[null,null,{"$f":"IF('Eingaben (Inputs)'!C100<>\"\",'Eingaben (Inputs)'!C100,\"\")","v":""},null,{"$f":"IF('Eingaben (Inputs)'!E100<>\"\",'Eingaben (Inputs)'!E100,\"\")","v":""}]
[null,null,{"$f":"IF('Eingaben (Inputs)'!C101<>\"\",'Eingaben (Inputs)'!C101,\"\")","v":"Fahr- und Nutzungsprofil (Angabe pro Fahrzeug)"},null,{"$f":"IF('Eingaben (Inputs)'!E101<>\"\",'Eingaben (Inputs)'!E101,\"\")","v":""}]
[null,null,{"$f":"IF('Eingaben (Inputs)'!C102<>\"\",'Eingaben (Inputs)'!C102,\"\")","v":"Nutzungsmuster"},{"$f":"'Eingaben (Inputs)'!D102","v":"Werktagsbetrieb"},{"$f":"IF('Eingaben (Inputs)'!E102<>\"\",'Eingaben (Inputs)'!E102,\"\")","v":""}]
[null,null,{"$f":"IF('Eingaben (Inputs)'!C103<>\"\",'Eingaben (Inputs)'!C103,\"\")","v":"Anzahl Arbeitstage pro Jahr"},{"$f":"INDEX('1e. Dropdown Values'!$A$7:$D$7,_xlfn.XMATCH(D102,'1e. Dropdown Values'!$A$6:$D$6))","v":260},{"$f":"IF('Eingaben (Inputs)'!E103<>\"\",'Eingaben (Inputs)'!E103,\"\")","v":""},{"$f":"\"Standardwert: \"&TEXT('1a. Defaults Segment-Ebene'!D103,\"##0\")","v":"Standardwert: 260"}]
[null,null,{"$f":"IF('Eingaben (Inputs)'!C104<>\"\",'Eingaben (Inputs)'!C104,\"\")","v":"Fahrdistanz während der Arbeitszeit"},{"$f":"INDEX('1e. Dropdown Values'!$A$4:$D$4,_xlfn.XMATCH(D92,'1e. Dropdown Values'!$A$3:$D$3))","v":100},{"$f":"IF('Eingaben (Inputs)'!E104<>\"\",'Eingaben (Inputs)'!E104,\"\")","v":"km/Tag"},{"$f":"\"Standardwert: \"&TEXT('1a. Defaults Segment-Ebene'!D104,\"##0\")&\" \"&E104","v":"Standardwert: 100 km/Tag"}]
[null,null,{"$f":"IF('Eingaben (Inputs)'!C105<>\"\",'Eingaben (Inputs)'!C105,\"\")","v":"Pendeldistanz (Hin- und Rückfahrt)"},{"$f":"(_xlfn.XMATCH(D91,Einsatzart)-1)*30","v":0},{"$f":"IF('Eingaben (Inputs)'!E105<>\"\",'Eingaben (Inputs)'!E105,\"\")","v":"km/Tag"},{"$f":"\"Standardwert: \"&TEXT('1a. Defaults Segment-Ebene'!D105,\"##0\")&\" \"&E105","v":"Standardwert: 0 km/Tag"}]
[null,null,{"$f":"IF('Eingaben (Inputs)'!C106<>\"\",'Eingaben (Inputs)'!C106,\"\")","v":"Anzahl Einsätze pro Tag"},1,{"$f":"IF('Eingaben (Inputs)'!E106<>\"\",'Eingaben (Inputs)'!E106,\"\")","v":""},{"$f":"\"Standardwert: \"&TEXT('1a. Defaults Segment-Ebene'!D106,\"##0\")","v":"Standardwert: 1"}]
[null,null,{"$f":"IF('Eingaben (Inputs)'!C107<>\"\",'Eingaben (Inputs)'!C107,\"\")","v":"Anzahl Pausen pro Tag"},null,{"$f":"IF('Eingaben (Inputs)'!E107<>\"\",'Eingaben (Inputs)'!E107,\"\")","v":""}]
[null,null,{"$f":"IF('Eingaben (Inputs)'!C108<>\"\",'Eingaben (Inputs)'!C108,\"\")","v":"Standzeit pro Pause am Firmenstandort"},{"$f":"INDEX('1e. Dropdown Values'!$A$9:$D$9,_xlfn.XMATCH(D102,'1e. Dropdown Values'!$A$6:$D$6))","v":1},{"$f":"IF('Eingaben (Inputs)'!E108<>\"\",'Eingaben (Inputs)'!E108,\"\")","v":"Stunden"},{"$f":"\"Standardwert: \"&TEXT('1a. Defaults Segment-Ebene'!D108,\"##0\")&\" \"&IF(D108=1,\"Stunde\",E108)","v":"Standardwert: 1 Stunde"}]
[null,null,{"$f":"IF('Eingaben (Inputs)'!C109<>\"\",'Eingaben (Inputs)'!C109,\"\")","v":"Standzeit über Nacht"},{"$f":"INDEX('1e. Dropdown Values'!$A$8:$D$8,_xlfn.XMATCH(D102,'1e. Dropdown Values'!$A$6:$D$6))","v":8},{"$f":"IF('Eingaben (Inputs)'!E109<>\"\",'Eingaben (Inputs)'!E109,\"\")","v":"Stunden"},{"$f":"\"Standardwert: \"&TEXT('1a. Defaults Segment-Ebene'!D109,\"##0\")&\" \"&IF(D109=1,\"Stunde\",E109)","v":"Standardwert: 8 Stunden"}]
[null,null,{"$f":"IF('Eingaben (Inputs)'!C110<>\"\",'Eingaben (Inputs)'!C110,\"\")","v":"Fahrzeuge pro Ladepunkt, Firmenstandort (tagsüber)"},{"$f":"INDEX('1e. Dropdown Values'!$B$10:$D$10,_xlfn.XMATCH(D102,Nutzungsmuster))","v":1},{"$f":"IF('Eingaben (Inputs)'!E110<>\"\",'Eingaben (Inputs)'!E110,\"\")","v":""},{"$f":"\"Standardwert: \"&TEXT('1a. Defaults Segment-Ebene'!D110,\"##0\")","v":"Standardwert: 1"}]
[null,null,{"$f":"IF('Eingaben (Inputs)'!C111<>\"\",'Eingaben (Inputs)'!C111,\"\")","v":""},null,{"$f":"IF('Eingaben (Inputs)'!E111<>\"\",'Eingaben (Inputs)'!E111,\"\")","v":""}]
[null,null,{"$f":"IF('Eingaben (Inputs)'!C112<>\"\",'Eingaben (Inputs)'!C112,\"\")","v":"Kosten (Angabe pro Fahrzeug)"},null,{"$f":"IF('Eingaben (Inputs)'!E112<>\"\",'Eingaben (Inputs)'!E112,\"\")","v":""}]
[null,null,{"$f":"IF('Eingaben (Inputs)'!C113<>\"\",'Eingaben (Inputs)'!C113,\"\")","v":"Laufzeit"},{"$f":"'Eingaben (Inputs)'!D113","v":48},{"$f":"IF('Eingaben (Inputs)'!E113<>\"\",'Eingaben (Inputs)'!E113,\"\")","v":"Monate"}]
[null,null,{"$f":"IF('Eingaben (Inputs)'!C114<>\"\",'Eingaben (Inputs)'!C114,\"\")","v":"Leasing-Zinssatz"},{"v":0.03,"d":"3.0%"},{"$f":"IF('Eingaben (Inputs)'!E114<>\"\",'Eingaben (Inputs)'!E114,\"\")","v":""},{"$f":"\"Standardwert: \"&TEXT('1a. Defaults Segment-Ebene'!D114,\"##0.0%\")","v":"Standardwert: 3.0%"}]
[null,null,{"$f":"IF('Eingaben (Inputs)'!C115<>\"\",'Eingaben (Inputs)'!C115,\"\")","v":"Anschaffungspreis inkl. Flottenrabatt Verbrenner"},{"$f":"INDEX('2d. Annahmen'!$H$13:$H$16,_xlfn.XMATCH(D96,'2d. Annahmen'!$B$4:$B$7))*(1-'2d. Annahmen'!$B$30)","v":{"v":27219.464999999997,"d":"27,219"}},{"$f":"IF('Eingaben (Inputs)'!E115<>\"\",'Eingaben (Inputs)'!E115,\"\")","v":"CHF"},{"$f":"\"Standardwert: \"&TEXT('1a. Defaults Segment-Ebene'!D115,\"#’##0\")&\" \"&E115","v":"Standardwert: 27’219 CHF"}]
[null,null,{"$f":"IF('Eingaben (Inputs)'!C116<>\"\",'Eingaben (Inputs)'!C116,\"\")","v":"Service- und Reparaturkosten Verbrenner"},{"$f":"INDEX('2d. Annahmen'!$J$13:$J$16,_xlfn.XMATCH(D96,Grösse))/20000","v":0.05},{"$f":"IF('Eingaben (Inputs)'!E116<>\"\",'Eingaben (Inputs)'!E116,\"\")","v":"CHF/km"},{"$f":"\"Standardwert: \"&TEXT('1a. Defaults Segment-Ebene'!D116,\"##0.000\")&\" \"&E116","v":"Standardwert: 0.050 CHF/km"}]
[null,null,{"$f":"IF('Eingaben (Inputs)'!C117<>\"\",'Eingaben (Inputs)'!C117,\"\")","v":"Restwert Verbrenner"},{"$f":"_xlfn.LET(_xlpm.class,D96,_xlpm.km,ROUNDUP(D103*IF(D90=INDEX(Einsatzart,1),D104,D104+D105)*D113/12/5000,0)*5000,_xlpm.lz,D113,_xlpm.totkm,'2d. Annahmen'!$B$76:$G$76,_xlpm.totlz,'2d. Annahmen'!$A$77:$A$82,_xlpm.rkm,MIN(MAX(_xlpm.km,MIN(_xlpm.totkm)),MAX(_xlpm.totkm)),_xlpm.r,_xlfn.XMATCH(_xlpm.lz,_xlpm.totlz),_xlpm.c,_xlfn.XMATCH(_xlpm.rkm,_xlpm.totkm),_xlpm.delta,1+INDEX('2d. Annahmen'!$K$13:$K$16,_xlfn.XMATCH(_xlpm.class,Grösse)),_xlpm.delta*INDEX('2d. Annahmen'!$B$77:$G$82,_xlpm.r,_xlpm.c))","v":{"v":0.31606388888888887,"d":"32%"}},{"$f":"IF('Eingaben (Inputs)'!E117<>\"\",'Eingaben (Inputs)'!E117,\"\")","v":""},{"$f":"\"Standardwert: \"&TEXT('1a. Defaults Segment-Ebene'!D117,\"##0.0%\")","v":"Standardwert: 31.6%"}]
[null,null,{"$f":"IF('Eingaben (Inputs)'!C118<>\"\",'Eingaben (Inputs)'!C118,\"\")","v":"Anschaffungspreis inkl. Flottenrabatt E-Fahrzeug"},{"$f":"INDEX('2d. Annahmen'!$K$4:$K$7,_xlfn.XMATCH(D96,'2d. Annahmen'!$B$4:$B$7))*(1-'2d. Annahmen'!$B$29)","v":{"v":28810.890000000003,"d":"28,811"}},{"$f":"IF('Eingaben (Inputs)'!E118<>\"\",'Eingaben (Inputs)'!E118,\"\")","v":"CHF"},{"$f":"\"Standardwert: \"&TEXT('1a. Defaults Segment-Ebene'!D118,\"#’##0\")&\" \"&E118","v":"Standardwert: 28’811 CHF"}]
[null,null,{"$f":"IF('Eingaben (Inputs)'!C119<>\"\",'Eingaben (Inputs)'!C119,\"\")","v":"Service- und Reparaturkosten E-Fahrzeug"},{"$f":"D116*0.5","v":0.025},{"$f":"IF('Eingaben (Inputs)'!E119<>\"\",'Eingaben (Inputs)'!E119,\"\")","v":"CHF/km"},{"$f":"\"Standardwert: \"&TEXT('1a. Defaults Segment-Ebene'!D119,\"0.000\")&\" \"&E119","v":"Standardwert: 0.025 CHF/km"}]
[null,null,{"$f":"IF('Eingaben (Inputs)'!C120<>\"\",'Eingaben (Inputs)'!C120,\"\")","v":"Restwert E-Fahrzeug"},{"$f":"_xlfn.LET(_xlpm.class,D96,_xlpm.km,ROUNDUP(D103*IF(D90=INDEX(Einsatzart,1),D104,D104+D105)*D113/12/5000,0)*5000,_xlpm.lz,D113,_xlpm.totkm,'2d. Annahmen'!$B$76:$G$76,_xlpm.totlz,'2d. Annahmen'!$A$77:$A$82,_xlpm.rkm,MIN(MAX(_xlpm.km,MIN(_xlpm.totkm)),MAX(_xlpm.totkm)),_xlpm.r,_xlfn.XMATCH(_xlpm.lz,_xlpm.totlz),_xlpm.c,_xlfn.XMATCH(_xlpm.rkm,_xlpm.totkm),_xlpm.delta,1+INDEX('2d. Annahmen'!$N$4:$N$7,_xlfn.XMATCH(_xlpm.class,Grösse)),_xlpm.delta*INDEX('2d. Annahmen'!$B$77:$G$82,_xlpm.r,_xlpm.c))","v":{"v":0.30658197222222217,"d":"31%"}},{"$f":"IF('Eingaben (Inputs)'!E120<>\"\",'Eingaben (Inputs)'!E120,\"\")","v":""},{"$f":"\"Standardwert: \"&TEXT('1a. Defaults Segment-Ebene'!D120,\"##0.0%\")","v":"Standardwert: 30.7%"}]
[null,null,{"$f":"IF('Eingaben (Inputs)'!C121<>\"\",'Eingaben (Inputs)'!C121,\"\")","v":""},null,{"$f":"IF('Eingaben (Inputs)'!E121<>\"\",'Eingaben (Inputs)'!E121,\"\")","v":""}]
[null,null,{"$f":"IF('Eingaben (Inputs)'!C122<>\"\",'Eingaben (Inputs)'!C122,\"\")","v":""},null,{"$f":"IF('Eingaben (Inputs)'!E122<>\"\",'Eingaben (Inputs)'!E122,\"\")","v":""}]
[null,"2.4)",{"$f":"IF('Eingaben (Inputs)'!C123<>\"\",'Eingaben (Inputs)'!C123,\"\")","v":"Segment D"},null,{"$f":"IF('Eingaben (Inputs)'!E123<>\"\",'Eingaben (Inputs)'!E123,\"\")","v":""}]
[null,null,{"$f":"IF('Eingaben (Inputs)'!C124<>\"\",'Eingaben (Inputs)'!C124,\"\")","v":""},null,{"$f":"IF('Eingaben (Inputs)'!E124<>\"\",'Eingaben (Inputs)'!E124,\"\")","v":""}]
[null,null,{"$f":"IF('Eingaben (Inputs)'!C125<>\"\",'Eingaben (Inputs)'!C125,\"\")","v":"Segmentstruktur"},null,{"$f":"IF('Eingaben (Inputs)'!E125<>\"\",'Eingaben (Inputs)'!E125,\"\")","v":""}]
[null,null,{"$f":"IF('Eingaben (Inputs)'!C126<>\"\",'Eingaben (Inputs)'!C126,\"\")","v":"Anzahl Fahrzeuge"},{"$f":"'Eingaben (Inputs)'!D126","v":1},{"$f":"IF('Eingaben (Inputs)'!E126<>\"\",'Eingaben (Inputs)'!E126,\"\")","v":""}]
[null,null,{"$f":"IF('Eingaben (Inputs)'!C127<>\"\",'Eingaben (Inputs)'!C127,\"\")","v":"Einsatzart"},{"$f":"'Eingaben (Inputs)'!D127","v":"Poolfahrzeuge"},{"$f":"IF('Eingaben (Inputs)'!E127<>\"\",'Eingaben (Inputs)'!E127,\"\")","v":""}]
[null,null,{"$f":"IF('Eingaben (Inputs)'!C128<>\"\",'Eingaben (Inputs)'!C128,\"\")","v":"Einsatzgebiet"},{"$f":"'Eingaben (Inputs)'!D128","v":"regional"},{"$f":"IF('Eingaben (Inputs)'!E128<>\"\",'Eingaben (Inputs)'!E128,\"\")","v":""}]
[null,null,{"$f":"IF('Eingaben (Inputs)'!C129<>\"\",'Eingaben (Inputs)'!C129,\"\")","v":"Heimlademöglichkeit"},{"$f":"INDEX(Heimladen,NOT(_xlfn.XMATCH(D127,Einsatzart)-1)+1)","v":"Nein"},{"$f":"IF('Eingaben (Inputs)'!E129<>\"\",'Eingaben (Inputs)'!E129,\"\")","v":""},{"$f":"\"Standardwert: \"&'1a. Defaults Segment-Ebene'!D129","v":"Standardwert: Nein"}]
[null,null,{"$f":"IF('Eingaben (Inputs)'!C130<>\"\",'Eingaben (Inputs)'!C130,\"\")","v":""},null,{"$f":"IF('Eingaben (Inputs)'!E130<>\"\",'Eingaben (Inputs)'!E130,\"\")","v":""}]
[null,null,{"$f":"IF('Eingaben (Inputs)'!C131<>\"\",'Eingaben (Inputs)'!C131,\"\")","v":"Fahrzeugdaten"},null,{"$f":"IF('Eingaben (Inputs)'!E131<>\"\",'Eingaben (Inputs)'!E131,\"\")","v":""}]
[null,null,{"$f":"IF('Eingaben (Inputs)'!C132<>\"\",'Eingaben (Inputs)'!C132,\"\")","v":"Fahrzeuggrösse"},{"$f":"'Eingaben (Inputs)'!D132","v":"Mittelklasse"},{"$f":"IF('Eingaben (Inputs)'!E132<>\"\",'Eingaben (Inputs)'!E132,\"\")","v":""}]
[null,null,{"$f":"IF('Eingaben (Inputs)'!C133<>\"\",'Eingaben (Inputs)'!C133,\"\")","v":"Treibstoffverbrauch Verbrenner"},{"$f":"INDEX('2d. Annahmen'!$F$13:$F$16,_xlfn.XMATCH(D132,Grösse))","v":5.8},{"$f":"IF('Eingaben (Inputs)'!E133<>\"\",'Eingaben (Inputs)'!E133,\"\")","v":"l/100 km"},{"$f":"\"Standardwert: \"&TEXT('1a. Defaults Segment-Ebene'!D133,\"##0.0\")&\" \"&E133","v":"Standardwert: 5.8 l/100 km"}]
[null,null,{"$f":"IF('Eingaben (Inputs)'!C134<>\"\",'Eingaben (Inputs)'!C134,\"\")","v":"Energieverbrauch E-Fahrzeug"},{"$f":"INDEX('2d. Annahmen'!$H$4:$H$7,_xlfn.XMATCH(D132,Grösse))","v":15.1},{"$f":"IF('Eingaben (Inputs)'!E134<>\"\",'Eingaben (Inputs)'!E134,\"\")","v":"kWh/100 km"},{"$f":"\"Standardwert: \"&TEXT('1a. Defaults Segment-Ebene'!D134,\"##0.0\")&\" \"&E134","v":"Standardwert: 15.1 kWh/100 km"}]
[null,null,{"$f":"IF('Eingaben (Inputs)'!C135<>\"\",'Eingaben (Inputs)'!C135,\"\")","v":"Batteriekapazität (netto)"},{"$f":"INDEX('2d. Annahmen'!$F$4:$F$7,_xlfn.XMATCH(D132,Grösse))","v":58.625},{"$f":"IF('Eingaben (Inputs)'!E135<>\"\",'Eingaben (Inputs)'!E135,\"\")","v":"kWh"},{"$f":"\"Standardwert: \"&TEXT('1a. Defaults Segment-Ebene'!D135,\"##0.0\")&\" \"&E135","v":"Standardwert: 58.6 kWh"}]
[null,null,{"$f":"IF('Eingaben (Inputs)'!C136<>\"\",'Eingaben (Inputs)'!C136,\"\")","v":""},null,{"$f":"IF('Eingaben (Inputs)'!E136<>\"\",'Eingaben (Inputs)'!E136,\"\")","v":""}]
[null,null,{"$f":"IF('Eingaben (Inputs)'!C137<>\"\",'Eingaben (Inputs)'!C137,\"\")","v":"Fahr- und Nutzungsprofil (Angabe pro Fahrzeug)"},null,{"$f":"IF('Eingaben (Inputs)'!E137<>\"\",'Eingaben (Inputs)'!E137,\"\")","v":""}]
[null,null,{"$f":"IF('Eingaben (Inputs)'!C138<>\"\",'Eingaben (Inputs)'!C138,\"\")","v":"Nutzungsmuster"},{"$f":"'Eingaben (Inputs)'!D138","v":"Werktagsbetrieb"},{"$f":"IF('Eingaben (Inputs)'!E138<>\"\",'Eingaben (Inputs)'!E138,\"\")","v":""}]
[null,null,{"$f":"IF('Eingaben (Inputs)'!C139<>\"\",'Eingaben (Inputs)'!C139,\"\")","v":"Anzahl Arbeitstage pro Jahr"},{"$f":"INDEX('1e. Dropdown Values'!$A$7:$D$7,_xlfn.XMATCH(D138,'1e. Dropdown Values'!$A$6:$D$6))","v":260},{"$f":"IF('Eingaben (Inputs)'!E139<>\"\",'Eingaben (Inputs)'!E139,\"\")","v":""},{"$f":"\"Standardwert: \"&TEXT('1a. Defaults Segment-Ebene'!D139,\"##0\")","v":"Standardwert: 260"}]
[null,null,{"$f":"IF('Eingaben (Inputs)'!C140<>\"\",'Eingaben (Inputs)'!C140,\"\")","v":"Fahrdistanz während der Arbeitszeit"},{"$f":"INDEX('1e. Dropdown Values'!$A$4:$D$4,_xlfn.XMATCH(D128,'1e. Dropdown Values'!$A$3:$D$3))","v":100},{"$f":"IF('Eingaben (Inputs)'!E140<>\"\",'Eingaben (Inputs)'!E140,\"\")","v":"km/Tag"},{"$f":"\"Standardwert: \"&TEXT('1a. Defaults Segment-Ebene'!D140,\"##0\")&\" \"&E140","v":"Standardwert: 100 km/Tag"}]
[null,null,{"$f":"IF('Eingaben (Inputs)'!C141<>\"\",'Eingaben (Inputs)'!C141,\"\")","v":"Pendeldistanz (Hin- und Rückfahrt)"},{"$f":"(_xlfn.XMATCH(D127,Einsatzart)-1)*30","v":0},{"$f":"IF('Eingaben (Inputs)'!E141<>\"\",'Eingaben (Inputs)'!E141,\"\")","v":"km/Tag"},{"$f":"\"Standardwert: \"&TEXT('1a. Defaults Segment-Ebene'!D141,\"##0\")&\" \"&E141","v":"Standardwert: 0 km/Tag"}]
[null,null,{"$f":"IF('Eingaben (Inputs)'!C142<>\"\",'Eingaben (Inputs)'!C142,\"\")","v":"Anzahl Einsätze pro Tag"},1,{"$f":"IF('Eingaben (Inputs)'!E142<>\"\",'Eingaben (Inputs)'!E142,\"\")","v":""},{"$f":"\"Standardwert: \"&TEXT('1a. Defaults Segment-Ebene'!D142,\"##0\")","v":"Standardwert: 1"}]
[null,null,{"$f":"IF('Eingaben (Inputs)'!C143<>\"\",'Eingaben (Inputs)'!C143,\"\")","v":"Anzahl Pausen pro Tag"},null,{"$f":"IF('Eingaben (Inputs)'!E143<>\"\",'Eingaben (Inputs)'!E143,\"\")","v":""}]
[null,null,{"$f":"IF('Eingaben (Inputs)'!C144<>\"\",'Eingaben (Inputs)'!C144,\"\")","v":"Standzeit pro Pause am Firmenstandort"},{"$f":"INDEX('1e. Dropdown Values'!$A$9:$D$9,_xlfn.XMATCH(D138,'1e. Dropdown Values'!$A$6:$D$6))","v":1},{"$f":"IF('Eingaben (Inputs)'!E144<>\"\",'Eingaben (Inputs)'!E144,\"\")","v":"Stunden"},{"$f":"\"Standardwert: \"&TEXT('1a. Defaults Segment-Ebene'!D144,\"##0\")&\" \"&IF(D144=1,\"Stunde\",E144)","v":"Standardwert: 1 Stunde"}]
[null,null,{"$f":"IF('Eingaben (Inputs)'!C145<>\"\",'Eingaben (Inputs)'!C145,\"\")","v":"Standzeit über Nacht"},{"$f":"INDEX('1e. Dropdown Values'!$A$8:$D$8,_xlfn.XMATCH(D138,'1e. Dropdown Values'!$A$6:$D$6))","v":8},{"$f":"IF('Eingaben (Inputs)'!E145<>\"\",'Eingaben (Inputs)'!E145,\"\")","v":"Stunden"},{"$f":"\"Standardwert: \"&TEXT('1a. Defaults Segment-Ebene'!D145,\"##0\")&\" \"&IF(D145=1,\"Stunde\",E145)","v":"Standardwert: 8 Stunden"}]
[null,null,{"$f":"IF('Eingaben (Inputs)'!C146<>\"\",'Eingaben (Inputs)'!C146,\"\")","v":"Fahrzeuge pro Ladepunkt, Firmenstandort (tagsüber)"},{"$f":"INDEX('1e. Dropdown Values'!$B$10:$D$10,_xlfn.XMATCH(D138,Nutzungsmuster))","v":1},{"$f":"IF('Eingaben (Inputs)'!E146<>\"\",'Eingaben (Inputs)'!E146,\"\")","v":""},{"$f":"\"Standardwert: \"&TEXT('1a. Defaults Segment-Ebene'!D146,\"##0\")","v":"Standardwert: 1"}]
[null,null,{"$f":"IF('Eingaben (Inputs)'!C147<>\"\",'Eingaben (Inputs)'!C147,\"\")","v":""},null,{"$f":"IF('Eingaben (Inputs)'!E147<>\"\",'Eingaben (Inputs)'!E147,\"\")","v":""}]
[null,null,{"$f":"IF('Eingaben (Inputs)'!C148<>\"\",'Eingaben (Inputs)'!C148,\"\")","v":"Kosten (Angabe pro Fahrzeug)"},null,{"$f":"IF('Eingaben (Inputs)'!E148<>\"\",'Eingaben (Inputs)'!E148,\"\")","v":""}]
[null,null,{"$f":"IF('Eingaben (Inputs)'!C149<>\"\",'Eingaben (Inputs)'!C149,\"\")","v":"Laufzeit"},{"$f":"'Eingaben (Inputs)'!D149","v":48},{"$f":"IF('Eingaben (Inputs)'!E149<>\"\",'Eingaben (Inputs)'!E149,\"\")","v":"Monate"}]
[null,null,{"$f":"IF('Eingaben (Inputs)'!C150<>\"\",'Eingaben (Inputs)'!C150,\"\")","v":"Leasing-Zinssatz"},{"v":0.03,"d":"3.0%"},{"$f":"IF('Eingaben (Inputs)'!E150<>\"\",'Eingaben (Inputs)'!E150,\"\")","v":""},{"$f":"\"Standardwert: \"&TEXT('1a. Defaults Segment-Ebene'!D150,\"##0.0%\")","v":"Standardwert: 3.0%"}]
[null,null,{"$f":"IF('Eingaben (Inputs)'!C151<>\"\",'Eingaben (Inputs)'!C151,\"\")","v":"Anschaffungspreis inkl. Flottenrabatt Verbrenner"},{"$f":"INDEX('2d. Annahmen'!$H$13:$H$16,_xlfn.XMATCH(D132,'2d. Annahmen'!$B$4:$B$7))*(1-'2d. Annahmen'!$B$30)","v":{"v":27219.464999999997,"d":"27,219"}},{"$f":"IF('Eingaben (Inputs)'!E151<>\"\",'Eingaben (Inputs)'!E151,\"\")","v":"CHF"},{"$f":"\"Standardwert: \"&TEXT('1a. Defaults Segment-Ebene'!D151,\"#’##0\")&\" \"&E151","v":"Standardwert: 27’219 CHF"}]
[null,null,{"$f":"IF('Eingaben (Inputs)'!C152<>\"\",'Eingaben (Inputs)'!C152,\"\")","v":"Service- und Reparaturkosten Verbrenner"},{"$f":"INDEX('2d. Annahmen'!$J$13:$J$16,_xlfn.XMATCH(D132,Grösse))/20000","v":0.05},{"$f":"IF('Eingaben (Inputs)'!E152<>\"\",'Eingaben (Inputs)'!E152,\"\")","v":"CHF/km"},{"$f":"\"Standardwert: \"&TEXT('1a. Defaults Segment-Ebene'!D152,\"##0.000\")&\" \"&E152","v":"Standardwert: 0.050 CHF/km"}]
[null,null,{"$f":"IF('Eingaben (Inputs)'!C153<>\"\",'Eingaben (Inputs)'!C153,\"\")","v":"Restwert Verbrenner"},{"$f":"_xlfn.LET(_xlpm.class,D132,_xlpm.km,ROUNDUP(D139*IF(D126=INDEX(Einsatzart,1),D140,D140+D141)*D149/12/5000,0)*5000,_xlpm.lz,D149,_xlpm.totkm,'2d. Annahmen'!$B$76:$G$76,_xlpm.totlz,'2d. Annahmen'!$A$77:$A$82,_xlpm.rkm,MIN(MAX(_xlpm.km,MIN(_xlpm.totkm)),MAX(_xlpm.totkm)),_xlpm.r,_xlfn.XMATCH(_xlpm.lz,_xlpm.totlz),_xlpm.c,_xlfn.XMATCH(_xlpm.rkm,_xlpm.totkm),_xlpm.delta,1+INDEX('2d. Annahmen'!$K$13:$K$16,_xlfn.XMATCH(_xlpm.class,Grösse)),_xlpm.delta*INDEX('2d. Annahmen'!$B$77:$G$82,_xlpm.r,_xlpm.c))","v":{"v":0.31606388888888887,"d":"32%"}},{"$f":"IF('Eingaben (Inputs)'!E153<>\"\",'Eingaben (Inputs)'!E153,\"\")","v":""},{"$f":"\"Standardwert: \"&TEXT('1a. Defaults Segment-Ebene'!D153,\"##0.0%\")","v":"Standardwert: 31.6%"}]
[null,null,{"$f":"IF('Eingaben (Inputs)'!C154<>\"\",'Eingaben (Inputs)'!C154,\"\")","v":"Anschaffungspreis inkl. Flottenrabatt E-Fahrzeug"},{"$f":"INDEX('2d. Annahmen'!$K$4:$K$7,_xlfn.XMATCH(D132,'2d. Annahmen'!$B$4:$B$7))*(1-'2d. Annahmen'!$B$29)","v":{"v":28810.890000000003,"d":"28,811"}},{"$f":"IF('Eingaben (Inputs)'!E154<>\"\",'Eingaben (Inputs)'!E154,\"\")","v":"CHF"},{"$f":"\"Standardwert: \"&TEXT('1a. Defaults Segment-Ebene'!D154,\"#’##0\")&\" \"&E154","v":"Standardwert: 28’811 CHF"}]
[null,null,{"$f":"IF('Eingaben (Inputs)'!C155<>\"\",'Eingaben (Inputs)'!C155,\"\")","v":"Service- und Reparaturkosten E-Fahrzeug"},{"$f":"D152*0.5","v":0.025},{"$f":"IF('Eingaben (Inputs)'!E155<>\"\",'Eingaben (Inputs)'!E155,\"\")","v":"CHF/km"},{"$f":"\"Standardwert: \"&TEXT('1a. Defaults Segment-Ebene'!D155,\"0.000\")&\" \"&E155","v":"Standardwert: 0.025 CHF/km"}]
[null,null,{"$f":"IF('Eingaben (Inputs)'!C156<>\"\",'Eingaben (Inputs)'!C156,\"\")","v":"Restwert E-Fahrzeug"},{"$f":"_xlfn.LET(_xlpm.class,D132,_xlpm.km,ROUNDUP(D139*IF(D126=INDEX(Einsatzart,1),D140,D140+D141)*D149/12/5000,0)*5000,_xlpm.lz,D149,_xlpm.totkm,'2d. Annahmen'!$B$76:$G$76,_xlpm.totlz,'2d. Annahmen'!$A$77:$A$82,_xlpm.rkm,MIN(MAX(_xlpm.km,MIN(_xlpm.totkm)),MAX(_xlpm.totkm)),_xlpm.r,_xlfn.XMATCH(_xlpm.lz,_xlpm.totlz),_xlpm.c,_xlfn.XMATCH(_xlpm.rkm,_xlpm.totkm),_xlpm.delta,1+INDEX('2d. Annahmen'!$N$4:$N$7,_xlfn.XMATCH(_xlpm.class,Grösse)),_xlpm.delta*INDEX('2d. Annahmen'!$B$77:$G$82,_xlpm.r,_xlpm.c))","v":{"v":0.30658197222222217,"d":"31%"}},{"$f":"IF('Eingaben (Inputs)'!E156<>\"\",'Eingaben (Inputs)'!E156,\"\")","v":""},{"$f":"\"Standardwert: \"&TEXT('1a. Defaults Segment-Ebene'!D156,\"##0.0%\")","v":"Standardwert: 30.7%"}]
[null,null,{"$f":"IF('Eingaben (Inputs)'!C157<>\"\",'Eingaben (Inputs)'!C157,\"\")","v":""},null,{"$f":"IF('Eingaben (Inputs)'!E157<>\"\",'Eingaben (Inputs)'!E157,\"\")","v":""}]
[null,null,{"$f":"IF('Eingaben (Inputs)'!C158<>\"\",'Eingaben (Inputs)'!C158,\"\")","v":""},null,{"$f":"IF('Eingaben (Inputs)'!E158<>\"\",'Eingaben (Inputs)'!E158,\"\")","v":""}]
[null,"2.5)",{"$f":"IF('Eingaben (Inputs)'!C159<>\"\",'Eingaben (Inputs)'!C159,\"\")","v":"Segment E"},null,{"$f":"IF('Eingaben (Inputs)'!E159<>\"\",'Eingaben (Inputs)'!E159,\"\")","v":""}]
[null,null,{"$f":"IF('Eingaben (Inputs)'!C160<>\"\",'Eingaben (Inputs)'!C160,\"\")","v":""},null,{"$f":"IF('Eingaben (Inputs)'!E160<>\"\",'Eingaben (Inputs)'!E160,\"\")","v":""}]
[null,null,{"$f":"IF('Eingaben (Inputs)'!C161<>\"\",'Eingaben (Inputs)'!C161,\"\")","v":"Segmentstruktur"},null,{"$f":"IF('Eingaben (Inputs)'!E161<>\"\",'Eingaben (Inputs)'!E161,\"\")","v":""}]
[null,null,{"$f":"IF('Eingaben (Inputs)'!C162<>\"\",'Eingaben (Inputs)'!C162,\"\")","v":"Anzahl Fahrzeuge"},{"$f":"'Eingaben (Inputs)'!D162","v":1},{"$f":"IF('Eingaben (Inputs)'!E162<>\"\",'Eingaben (Inputs)'!E162,\"\")","v":""}]
[null,null,{"$f":"IF('Eingaben (Inputs)'!C163<>\"\",'Eingaben (Inputs)'!C163,\"\")","v":"Einsatzart"},{"$f":"'Eingaben (Inputs)'!D163","v":"Poolfahrzeuge"},{"$f":"IF('Eingaben (Inputs)'!E163<>\"\",'Eingaben (Inputs)'!E163,\"\")","v":""}]
[null,null,{"$f":"IF('Eingaben (Inputs)'!C164<>\"\",'Eingaben (Inputs)'!C164,\"\")","v":"Einsatzgebiet"},{"$f":"'Eingaben (Inputs)'!D164","v":"regional"},{"$f":"IF('Eingaben (Inputs)'!E164<>\"\",'Eingaben (Inputs)'!E164,\"\")","v":""}]
[null,null,{"$f":"IF('Eingaben (Inputs)'!C165<>\"\",'Eingaben (Inputs)'!C165,\"\")","v":"Heimlademöglichkeit"},{"$f":"INDEX(Heimladen,NOT(_xlfn.XMATCH(D163,Einsatzart)-1)+1)","v":"Nein"},{"$f":"IF('Eingaben (Inputs)'!E165<>\"\",'Eingaben (Inputs)'!E165,\"\")","v":""},{"$f":"\"Standardwert: \"&'1a. Defaults Segment-Ebene'!D165","v":"Standardwert: Nein"}]
[null,null,{"$f":"IF('Eingaben (Inputs)'!C166<>\"\",'Eingaben (Inputs)'!C166,\"\")","v":""},null,{"$f":"IF('Eingaben (Inputs)'!E166<>\"\",'Eingaben (Inputs)'!E166,\"\")","v":""}]
[null,null,{"$f":"IF('Eingaben (Inputs)'!C167<>\"\",'Eingaben (Inputs)'!C167,\"\")","v":"Fahrzeugdaten"},null,{"$f":"IF('Eingaben (Inputs)'!E167<>\"\",'Eingaben (Inputs)'!E167,\"\")","v":""}]
[null,null,{"$f":"IF('Eingaben (Inputs)'!C168<>\"\",'Eingaben (Inputs)'!C168,\"\")","v":"Fahrzeuggrösse"},{"$f":"'Eingaben (Inputs)'!D168","v":"Mittelklasse"},{"$f":"IF('Eingaben (Inputs)'!E168<>\"\",'Eingaben (Inputs)'!E168,\"\")","v":""}]
[null,null,{"$f":"IF('Eingaben (Inputs)'!C169<>\"\",'Eingaben (Inputs)'!C169,\"\")","v":"Treibstoffverbrauch Verbrenner"},{"$f":"INDEX('2d. Annahmen'!$F$13:$F$16,_xlfn.XMATCH(D168,Grösse))","v":5.8},{"$f":"IF('Eingaben (Inputs)'!E169<>\"\",'Eingaben (Inputs)'!E169,\"\")","v":"l/100 km"},{"$f":"\"Standardwert: \"&TEXT('1a. Defaults Segment-Ebene'!D169,\"##0.0\")&\" \"&E169","v":"Standardwert: 5.8 l/100 km"}]
[null,null,{"$f":"IF('Eingaben (Inputs)'!C170<>\"\",'Eingaben (Inputs)'!C170,\"\")","v":"Energieverbrauch E-Fahrzeug"},{"$f":"INDEX('2d. Annahmen'!$H$4:$H$7,_xlfn.XMATCH(D168,Grösse))","v":15.1},{"$f":"IF('Eingaben (Inputs)'!E170<>\"\",'Eingaben (Inputs)'!E170,\"\")","v":"kWh/100 km"},{"$f":"\"Standardwert: \"&TEXT('1a. Defaults Segment-Ebene'!D170,\"##0.0\")&\" \"&E170","v":"Standardwert: 15.1 kWh/100 km"}]
[null,null,{"$f":"IF('Eingaben (Inputs)'!C171<>\"\",'Eingaben (Inputs)'!C171,\"\")","v":"Batteriekapazität (netto)"},{"$f":"INDEX('2d. Annahmen'!$F$4:$F$7,_xlfn.XMATCH(D168,Grösse))","v":58.625},{"$f":"IF('Eingaben (Inputs)'!E171<>\"\",'Eingaben (Inputs)'!E171,\"\")","v":"kWh"},{"$f":"\"Standardwert: \"&TEXT('1a. Defaults Segment-Ebene'!D171,\"##0.0\")&\" \"&E171","v":"Standardwert: 58.6 kWh"}]
[null,null,{"$f":"IF('Eingaben (Inputs)'!C172<>\"\",'Eingaben (Inputs)'!C172,\"\")","v":""},null,{"$f":"IF('Eingaben (Inputs)'!E172<>\"\",'Eingaben (Inputs)'!E172,\"\")","v":""}]
[null,null,{"$f":"IF('Eingaben (Inputs)'!C173<>\"\",'Eingaben (Inputs)'!C173,\"\")","v":"Fahr- und Nutzungsprofil (Angabe pro Fahrzeug)"},null,{"$f":"IF('Eingaben (Inputs)'!E173<>\"\",'Eingaben (Inputs)'!E173,\"\")","v":""}]
[null,null,{"$f":"IF('Eingaben (Inputs)'!C174<>\"\",'Eingaben (Inputs)'!C174,\"\")","v":"Nutzungsmuster"},{"$f":"'Eingaben (Inputs)'!D174","v":"Werktagsbetrieb"},{"$f":"IF('Eingaben (Inputs)'!E174<>\"\",'Eingaben (Inputs)'!E174,\"\")","v":""}]
[null,null,{"$f":"IF('Eingaben (Inputs)'!C175<>\"\",'Eingaben (Inputs)'!C175,\"\")","v":"Anzahl Arbeitstage pro Jahr"},{"$f":"INDEX('1e. Dropdown Values'!$A$7:$D$7,_xlfn.XMATCH(D174,'1e. Dropdown Values'!$A$6:$D$6))","v":260},{"$f":"IF('Eingaben (Inputs)'!E175<>\"\",'Eingaben (Inputs)'!E175,\"\")","v":""},{"$f":"\"Standardwert: \"&TEXT('1a. Defaults Segment-Ebene'!D175,\"##0\")","v":"Standardwert: 260"}]
[null,null,{"$f":"IF('Eingaben (Inputs)'!C176<>\"\",'Eingaben (Inputs)'!C176,\"\")","v":"Fahrdistanz während der Arbeitszeit"},{"$f":"INDEX('1e. Dropdown Values'!$A$4:$D$4,_xlfn.XMATCH(D164,'1e. Dropdown Values'!$A$3:$D$3))","v":100},{"$f":"IF('Eingaben (Inputs)'!E176<>\"\",'Eingaben (Inputs)'!E176,\"\")","v":"km/Tag"},{"$f":"\"Standardwert: \"&TEXT('1a. Defaults Segment-Ebene'!D176,\"##0\")&\" \"&E176","v":"Standardwert: 100 km/Tag"}]
[null,null,{"$f":"IF('Eingaben (Inputs)'!C177<>\"\",'Eingaben (Inputs)'!C177,\"\")","v":"Pendeldistanz (Hin- und Rückfahrt)"},{"$f":"(_xlfn.XMATCH(D163,Einsatzart)-1)*30","v":0},{"$f":"IF('Eingaben (Inputs)'!E177<>\"\",'Eingaben (Inputs)'!E177,\"\")","v":"km/Tag"},{"$f":"\"Standardwert: \"&TEXT('1a. Defaults Segment-Ebene'!D177,\"##0\")&\" \"&E177","v":"Standardwert: 0 km/Tag"}]
[null,null,{"$f":"IF('Eingaben (Inputs)'!C178<>\"\",'Eingaben (Inputs)'!C178,\"\")","v":"Anzahl Einsätze pro Tag"},1,{"$f":"IF('Eingaben (Inputs)'!E178<>\"\",'Eingaben (Inputs)'!E178,\"\")","v":""},{"$f":"\"Standardwert: \"&TEXT('1a. Defaults Segment-Ebene'!D178,\"##0\")","v":"Standardwert: 1"}]
[null,null,{"$f":"IF('Eingaben (Inputs)'!C179<>\"\",'Eingaben (Inputs)'!C179,\"\")","v":"Anzahl Pausen pro Tag"},null,{"$f":"IF('Eingaben (Inputs)'!E179<>\"\",'Eingaben (Inputs)'!E179,\"\")","v":""}]
[null,null,{"$f":"IF('Eingaben (Inputs)'!C180<>\"\",'Eingaben (Inputs)'!C180,\"\")","v":"Standzeit pro Pause am Firmenstandort"},{"$f":"INDEX('1e. Dropdown Values'!$A$9:$D$9,_xlfn.XMATCH(D174,'1e. Dropdown Values'!$A$6:$D$6))","v":1},{"$f":"IF('Eingaben (Inputs)'!E180<>\"\",'Eingaben (Inputs)'!E180,\"\")","v":"Stunden"},{"$f":"\"Standardwert: \"&TEXT('1a. Defaults Segment-Ebene'!D180,\"##0\")&\" \"&IF(D180=1,\"Stunde\",E180)","v":"Standardwert: 1 Stunde"}]
[null,null,{"$f":"IF('Eingaben (Inputs)'!C181<>\"\",'Eingaben (Inputs)'!C181,\"\")","v":"Standzeit über Nacht"},{"$f":"INDEX('1e. Dropdown Values'!$A$8:$D$8,_xlfn.XMATCH(D174,'1e. Dropdown Values'!$A$6:$D$6))","v":8},{"$f":"IF('Eingaben (Inputs)'!E181<>\"\",'Eingaben (Inputs)'!E181,\"\")","v":"Stunden"},{"$f":"\"Standardwert: \"&TEXT('1a. Defaults Segment-Ebene'!D181,\"##0\")&\" \"&IF(D181=1,\"Stunde\",E181)","v":"Standardwert: 8 Stunden"}]
[null,null,{"$f":"IF('Eingaben (Inputs)'!C182<>\"\",'Eingaben (Inputs)'!C182,\"\")","v":"Fahrzeuge pro Ladepunkt, Firmenstandort (tagsüber)"},{"$f":"INDEX('1e. Dropdown Values'!$B$10:$D$10,_xlfn.XMATCH(D174,Nutzungsmuster))","v":1},{"$f":"IF('Eingaben (Inputs)'!E182<>\"\",'Eingaben (Inputs)'!E182,\"\")","v":""},{"$f":"\"Standardwert: \"&TEXT('1a. Defaults Segment-Ebene'!D182,\"##0\")","v":"Standardwert: 1"}]
[null,null,{"$f":"IF('Eingaben (Inputs)'!C183<>\"\",'Eingaben (Inputs)'!C183,\"\")","v":""},null,{"$f":"IF('Eingaben (Inputs)'!E183<>\"\",'Eingaben (Inputs)'!E183,\"\")","v":""}]
[null,null,{"$f":"IF('Eingaben (Inputs)'!C184<>\"\",'Eingaben (Inputs)'!C184,\"\")","v":"Kosten (Angabe pro Fahrzeug)"},null,{"$f":"IF('Eingaben (Inputs)'!E184<>\"\",'Eingaben (Inputs)'!E184,\"\")","v":""}]
[null,null,{"$f":"IF('Eingaben (Inputs)'!C185<>\"\",'Eingaben (Inputs)'!C185,\"\")","v":"Laufzeit"},{"$f":"'Eingaben (Inputs)'!D185","v":48},{"$f":"IF('Eingaben (Inputs)'!E185<>\"\",'Eingaben (Inputs)'!E185,\"\")","v":"Monate"}]
[null,null,{"$f":"IF('Eingaben (Inputs)'!C186<>\"\",'Eingaben (Inputs)'!C186,\"\")","v":"Leasing-Zinssatz"},{"v":0.03,"d":"3.0%"},{"$f":"IF('Eingaben (Inputs)'!E186<>\"\",'Eingaben (Inputs)'!E186,\"\")","v":""},{"$f":"\"Standardwert: \"&TEXT('1a. Defaults Segment-Ebene'!D186,\"##0.0%\")","v":"Standardwert: 3.0%"}]
[null,null,{"$f":"IF('Eingaben (Inputs)'!C187<>\"\",'Eingaben (Inputs)'!C187,\"\")","v":"Anschaffungspreis inkl. Flottenrabatt Verbrenner"},{"$f":"INDEX('2d. Annahmen'!$H$13:$H$16,_xlfn.XMATCH(D168,'2d. Annahmen'!$B$4:$B$7))*(1-'2d. Annahmen'!$B$30)","v":{"v":27219.464999999997,"d":"27,219"}},{"$f":"IF('Eingaben (Inputs)'!E187<>\"\",'Eingaben (Inputs)'!E187,\"\")","v":"CHF"},{"$f":"\"Standardwert: \"&TEXT('1a. Defaults Segment-Ebene'!D187,\"#’##0\")&\" \"&E187","v":"Standardwert: 27’219 CHF"}]
[null,null,{"$f":"IF('Eingaben (Inputs)'!C188<>\"\",'Eingaben (Inputs)'!C188,\"\")","v":"Service- und Reparaturkosten Verbrenner"},{"$f":"INDEX('2d. Annahmen'!$J$13:$J$16,_xlfn.XMATCH(D168,Grösse))/20000","v":0.05},{"$f":"IF('Eingaben (Inputs)'!E188<>\"\",'Eingaben (Inputs)'!E188,\"\")","v":"CHF/km"},{"$f":"\"Standardwert: \"&TEXT('1a. Defaults Segment-Ebene'!D188,\"##0.000\")&\" \"&E188","v":"Standardwert: 0.050 CHF/km"}]
[null,null,{"$f":"IF('Eingaben (Inputs)'!C189<>\"\",'Eingaben (Inputs)'!C189,\"\")","v":"Restwert Verbrenner"},{"$f":"_xlfn.LET(_xlpm.class,D168,_xlpm.km,ROUNDUP(D175*IF(D162=INDEX(Einsatzart,1),D176,D176+D177)*D185/12/5000,0)*5000,_xlpm.lz,D185,_xlpm.totkm,'2d. Annahmen'!$B$76:$G$76,_xlpm.totlz,'2d. Annahmen'!$A$77:$A$82,_xlpm.rkm,MIN(MAX(_xlpm.km,MIN(_xlpm.totkm)),MAX(_xlpm.totkm)),_xlpm.r,_xlfn.XMATCH(_xlpm.lz,_xlpm.totlz),_xlpm.c,_xlfn.XMATCH(_xlpm.rkm,_xlpm.totkm),_xlpm.delta,1+INDEX('2d. Annahmen'!$K$13:$K$16,_xlfn.XMATCH(_xlpm.class,Grösse)),_xlpm.delta*INDEX('2d. Annahmen'!$B$77:$G$82,_xlpm.r,_xlpm.c))","v":{"v":0.31606388888888887,"d":"32%"}},{"$f":"IF('Eingaben (Inputs)'!E189<>\"\",'Eingaben (Inputs)'!E189,\"\")","v":""},{"$f":"\"Standardwert: \"&TEXT('1a. Defaults Segment-Ebene'!D189,\"##0.0%\")","v":"Standardwert: 31.6%"}]
[null,null,{"$f":"IF('Eingaben (Inputs)'!C190<>\"\",'Eingaben (Inputs)'!C190,\"\")","v":"Anschaffungspreis inkl. Flottenrabatt E-Fahrzeug"},{"$f":"INDEX('2d. Annahmen'!$K$4:$K$7,_xlfn.XMATCH(D168,'2d. Annahmen'!$B$4:$B$7))*(1-'2d. Annahmen'!$B$29)","v":{"v":28810.890000000003,"d":"28,811"}},{"$f":"IF('Eingaben (Inputs)'!E190<>\"\",'Eingaben (Inputs)'!E190,\"\")","v":"CHF"},{"$f":"\"Standardwert: \"&TEXT('1a. Defaults Segment-Ebene'!D190,\"#’##0\")&\" \"&E190","v":"Standardwert: 28’811 CHF"}]
[null,null,{"$f":"IF('Eingaben (Inputs)'!C191<>\"\",'Eingaben (Inputs)'!C191,\"\")","v":"Service- und Reparaturkosten E-Fahrzeug"},{"$f":"D188*0.5","v":0.025},{"$f":"IF('Eingaben (Inputs)'!E191<>\"\",'Eingaben (Inputs)'!E191,\"\")","v":"CHF/km"},{"$f":"\"Standardwert: \"&TEXT('1a. Defaults Segment-Ebene'!D191,\"0.000\")&\" \"&E191","v":"Standardwert: 0.025 CHF/km"}]
[null,null,{"$f":"IF('Eingaben (Inputs)'!C192<>\"\",'Eingaben (Inputs)'!C192,\"\")","v":"Restwert E-Fahrzeug"},{"$f":"_xlfn.LET(_xlpm.class,D168,_xlpm.km,ROUNDUP(D175*IF(D162=INDEX(Einsatzart,1),D176,D176+D177)*D185/12/5000,0)*5000,_xlpm.lz,D185,_xlpm.totkm,'2d. Annahmen'!$B$76:$G$76,_xlpm.totlz,'2d. Annahmen'!$A$77:$A$82,_xlpm.rkm,MIN(MAX(_xlpm.km,MIN(_xlpm.totkm)),MAX(_xlpm.totkm)),_xlpm.r,_xlfn.XMATCH(_xlpm.lz,_xlpm.totlz),_xlpm.c,_xlfn.XMATCH(_xlpm.rkm,_xlpm.totkm),_xlpm.delta,1+INDEX('2d. Annahmen'!$N$4:$N$7,_xlfn.XMATCH(_xlpm.class,Grösse)),_xlpm.delta*INDEX('2d. Annahmen'!$B$77:$G$82,_xlpm.r,_xlpm.c))","v":{"v":0.30658197222222217,"d":"31%"}},{"$f":"IF('Eingaben (Inputs)'!E192<>\"\",'Eingaben (Inputs)'!E192,\"\")","v":""},{"$f":"\"Standardwert: \"&TEXT('1a. Defaults Segment-Ebene'!D192,\"##0.0%\")","v":"Standardwert: 30.7%"}]
[null,null,{"$f":"IF('Eingaben (Inputs)'!C193<>\"\",'Eingaben (Inputs)'!C193,\"\")","v":""},null,{"$f":"IF('Eingaben (Inputs)'!E193<>\"\",'Eingaben (Inputs)'!E193,\"\")","v":""}]
[null,null,{"$f":"IF('Eingaben (Inputs)'!C194<>\"\",'Eingaben (Inputs)'!C194,\"\")","v":""},null,{"$f":"IF('Eingaben (Inputs)'!E194<>\"\",'Eingaben (Inputs)'!E194,\"\")","v":""}]
[null,"2.6)",{"$f":"IF('Eingaben (Inputs)'!C195<>\"\",'Eingaben (Inputs)'!C195,\"\")","v":"Segment F"},null,{"$f":"IF('Eingaben (Inputs)'!E195<>\"\",'Eingaben (Inputs)'!E195,\"\")","v":""}]
[null,null,{"$f":"IF('Eingaben (Inputs)'!C196<>\"\",'Eingaben (Inputs)'!C196,\"\")","v":""},null,{"$f":"IF('Eingaben (Inputs)'!E196<>\"\",'Eingaben (Inputs)'!E196,\"\")","v":""}]
[null,null,{"$f":"IF('Eingaben (Inputs)'!C197<>\"\",'Eingaben (Inputs)'!C197,\"\")","v":"Segmentstruktur"},null,{"$f":"IF('Eingaben (Inputs)'!E197<>\"\",'Eingaben (Inputs)'!E197,\"\")","v":""}]
[null,null,{"$f":"IF('Eingaben (Inputs)'!C198<>\"\",'Eingaben (Inputs)'!C198,\"\")","v":"Anzahl Fahrzeuge"},{"$f":"'Eingaben (Inputs)'!D198","v":1},{"$f":"IF('Eingaben (Inputs)'!E198<>\"\",'Eingaben (Inputs)'!E198,\"\")","v":""}]
[null,null,{"$f":"IF('Eingaben (Inputs)'!C199<>\"\",'Eingaben (Inputs)'!C199,\"\")","v":"Einsatzart"},{"$f":"'Eingaben (Inputs)'!D199","v":"Poolfahrzeuge"},{"$f":"IF('Eingaben (Inputs)'!E199<>\"\",'Eingaben (Inputs)'!E199,\"\")","v":""}]
[null,null,{"$f":"IF('Eingaben (Inputs)'!C200<>\"\",'Eingaben (Inputs)'!C200,\"\")","v":"Einsatzgebiet"},{"$f":"'Eingaben (Inputs)'!D200","v":"regional"},{"$f":"IF('Eingaben (Inputs)'!E200<>\"\",'Eingaben (Inputs)'!E200,\"\")","v":""}]
[null,null,{"$f":"IF('Eingaben (Inputs)'!C201<>\"\",'Eingaben (Inputs)'!C201,\"\")","v":"Heimlademöglichkeit"},{"$f":"INDEX(Heimladen,NOT(_xlfn.XMATCH(D199,Einsatzart)-1)+1)","v":"Nein"},{"$f":"IF('Eingaben (Inputs)'!E201<>\"\",'Eingaben (Inputs)'!E201,\"\")","v":""},{"$f":"\"Standardwert: \"&'1a. Defaults Segment-Ebene'!D201","v":"Standardwert: Nein"}]
[null,null,{"$f":"IF('Eingaben (Inputs)'!C202<>\"\",'Eingaben (Inputs)'!C202,\"\")","v":""},null,{"$f":"IF('Eingaben (Inputs)'!E202<>\"\",'Eingaben (Inputs)'!E202,\"\")","v":""}]
[null,null,{"$f":"IF('Eingaben (Inputs)'!C203<>\"\",'Eingaben (Inputs)'!C203,\"\")","v":"Fahrzeugdaten"},null,{"$f":"IF('Eingaben (Inputs)'!E203<>\"\",'Eingaben (Inputs)'!E203,\"\")","v":""}]
[null,null,{"$f":"IF('Eingaben (Inputs)'!C204<>\"\",'Eingaben (Inputs)'!C204,\"\")","v":"Fahrzeuggrösse"},{"$f":"'Eingaben (Inputs)'!D204","v":"Mittelklasse"},{"$f":"IF('Eingaben (Inputs)'!E204<>\"\",'Eingaben (Inputs)'!E204,\"\")","v":""}]
[null,null,{"$f":"IF('Eingaben (Inputs)'!C205<>\"\",'Eingaben (Inputs)'!C205,\"\")","v":"Treibstoffverbrauch Verbrenner"},{"$f":"INDEX('2d. Annahmen'!$F$13:$F$16,_xlfn.XMATCH(D204,Grösse))","v":5.8},{"$f":"IF('Eingaben (Inputs)'!E205<>\"\",'Eingaben (Inputs)'!E205,\"\")","v":"l/100 km"},{"$f":"\"Standardwert: \"&TEXT('1a. Defaults Segment-Ebene'!D205,\"##0.0\")&\" \"&E205","v":"Standardwert: 5.8 l/100 km"}]
[null,null,{"$f":"IF('Eingaben (Inputs)'!C206<>\"\",'Eingaben (Inputs)'!C206,\"\")","v":"Energieverbrauch E-Fahrzeug"},{"$f":"INDEX('2d. Annahmen'!$H$4:$H$7,_xlfn.XMATCH(D204,Grösse))","v":15.1},{"$f":"IF('Eingaben (Inputs)'!E206<>\"\",'Eingaben (Inputs)'!E206,\"\")","v":"kWh/100 km"},{"$f":"\"Standardwert: \"&TEXT('1a. Defaults Segment-Ebene'!D206,\"##0.0\")&\" \"&E206","v":"Standardwert: 15.1 kWh/100 km"}]
[null,null,{"$f":"IF('Eingaben (Inputs)'!C207<>\"\",'Eingaben (Inputs)'!C207,\"\")","v":"Batteriekapazität (netto)"},{"$f":"INDEX('2d. Annahmen'!$F$4:$F$7,_xlfn.XMATCH(D204,Grösse))","v":58.625},{"$f":"IF('Eingaben (Inputs)'!E207<>\"\",'Eingaben (Inputs)'!E207,\"\")","v":"kWh"},{"$f":"\"Standardwert: \"&TEXT('1a. Defaults Segment-Ebene'!D207,\"##0.0\")&\" \"&E207","v":"Standardwert: 58.6 kWh"}]
[null,null,{"$f":"IF('Eingaben (Inputs)'!C208<>\"\",'Eingaben (Inputs)'!C208,\"\")","v":""},null,{"$f":"IF('Eingaben (Inputs)'!E208<>\"\",'Eingaben (Inputs)'!E208,\"\")","v":""}]
[null,null,{"$f":"IF('Eingaben (Inputs)'!C209<>\"\",'Eingaben (Inputs)'!C209,\"\")","v":"Fahr- und Nutzungsprofil (Angabe pro Fahrzeug)"},null,{"$f":"IF('Eingaben (Inputs)'!E209<>\"\",'Eingaben (Inputs)'!E209,\"\")","v":""}]
[null,null,{"$f":"IF('Eingaben (Inputs)'!C210<>\"\",'Eingaben (Inputs)'!C210,\"\")","v":"Nutzungsmuster"},{"$f":"'Eingaben (Inputs)'!D210","v":"Werktagsbetrieb"},{"$f":"IF('Eingaben (Inputs)'!E210<>\"\",'Eingaben (Inputs)'!E210,\"\")","v":""}]
[null,null,{"$f":"IF('Eingaben (Inputs)'!C211<>\"\",'Eingaben (Inputs)'!C211,\"\")","v":"Anzahl Arbeitstage pro Jahr"},{"$f":"INDEX('1e. Dropdown Values'!$A$7:$D$7,_xlfn.XMATCH(D210,'1e. Dropdown Values'!$A$6:$D$6))","v":260},{"$f":"IF('Eingaben (Inputs)'!E211<>\"\",'Eingaben (Inputs)'!E211,\"\")","v":""},{"$f":"\"Standardwert: \"&TEXT('1a. Defaults Segment-Ebene'!D211,\"##0\")","v":"Standardwert: 260"}]
[null,null,{"$f":"IF('Eingaben (Inputs)'!C212<>\"\",'Eingaben (Inputs)'!C212,\"\")","v":"Fahrdistanz während der Arbeitszeit"},{"$f":"INDEX('1e. Dropdown Values'!$A$4:$D$4,_xlfn.XMATCH(D200,'1e. Dropdown Values'!$A$3:$D$3))","v":100},{"$f":"IF('Eingaben (Inputs)'!E212<>\"\",'Eingaben (Inputs)'!E212,\"\")","v":"km/Tag"},{"$f":"\"Standardwert: \"&TEXT('1a. Defaults Segment-Ebene'!D212,\"##0\")&\" \"&E212","v":"Standardwert: 100 km/Tag"}]
[null,null,{"$f":"IF('Eingaben (Inputs)'!C213<>\"\",'Eingaben (Inputs)'!C213,\"\")","v":"Pendeldistanz (Hin- und Rückfahrt)"},{"$f":"(_xlfn.XMATCH(D199,Einsatzart)-1)*30","v":0},{"$f":"IF('Eingaben (Inputs)'!E213<>\"\",'Eingaben (Inputs)'!E213,\"\")","v":"km/Tag"},{"$f":"\"Standardwert: \"&TEXT('1a. Defaults Segment-Ebene'!D213,\"##0\")&\" \"&E213","v":"Standardwert: 0 km/Tag"}]
[null,null,{"$f":"IF('Eingaben (Inputs)'!C214<>\"\",'Eingaben (Inputs)'!C214,\"\")","v":"Anzahl Einsätze pro Tag"},1,{"$f":"IF('Eingaben (Inputs)'!E214<>\"\",'Eingaben (Inputs)'!E214,\"\")","v":""},{"$f":"\"Standardwert: \"&TEXT('1a. Defaults Segment-Ebene'!D214,\"##0\")","v":"Standardwert: 1"}]
[null,null,{"$f":"IF('Eingaben (Inputs)'!C215<>\"\",'Eingaben (Inputs)'!C215,\"\")","v":"Anzahl Pausen pro Tag"},null,{"$f":"IF('Eingaben (Inputs)'!E215<>\"\",'Eingaben (Inputs)'!E215,\"\")","v":""}]
[null,null,{"$f":"IF('Eingaben (Inputs)'!C216<>\"\",'Eingaben (Inputs)'!C216,\"\")","v":"Standzeit pro Pause am Firmenstandort"},{"$f":"INDEX('1e. Dropdown Values'!$A$9:$D$9,_xlfn.XMATCH(D210,'1e. Dropdown Values'!$A$6:$D$6))","v":1},{"$f":"IF('Eingaben (Inputs)'!E216<>\"\",'Eingaben (Inputs)'!E216,\"\")","v":"Stunden"},{"$f":"\"Standardwert: \"&TEXT('1a. Defaults Segment-Ebene'!D216,\"##0\")&\" \"&IF(D216=1,\"Stunde\",E216)","v":"Standardwert: 1 Stunde"}]
[null,null,{"$f":"IF('Eingaben (Inputs)'!C217<>\"\",'Eingaben (Inputs)'!C217,\"\")","v":"Standzeit über Nacht"},{"$f":"INDEX('1e. Dropdown Values'!$A$8:$D$8,_xlfn.XMATCH(D210,'1e. Dropdown Values'!$A$6:$D$6))","v":8},{"$f":"IF('Eingaben (Inputs)'!E217<>\"\",'Eingaben (Inputs)'!E217,\"\")","v":"Stunden"},{"$f":"\"Standardwert: \"&TEXT('1a. Defaults Segment-Ebene'!D217,\"##0\")&\" \"&IF(D217=1,\"Stunde\",E217)","v":"Standardwert: 8 Stunden"}]
[null,null,{"$f":"IF('Eingaben (Inputs)'!C218<>\"\",'Eingaben (Inputs)'!C218,\"\")","v":"Fahrzeuge pro Ladepunkt, Firmenstandort (tagsüber)"},{"$f":"INDEX('1e. Dropdown Values'!$B$10:$D$10,_xlfn.XMATCH(D210,Nutzungsmuster))","v":1},{"$f":"IF('Eingaben (Inputs)'!E218<>\"\",'Eingaben (Inputs)'!E218,\"\")","v":""},{"$f":"\"Standardwert: \"&TEXT('1a. Defaults Segment-Ebene'!D218,\"##0\")","v":"Standardwert: 1"}]
[null,null,{"$f":"IF('Eingaben (Inputs)'!C219<>\"\",'Eingaben (Inputs)'!C219,\"\")","v":""},null,{"$f":"IF('Eingaben (Inputs)'!E219<>\"\",'Eingaben (Inputs)'!E219,\"\")","v":""}]
[null,null,{"$f":"IF('Eingaben (Inputs)'!C220<>\"\",'Eingaben (Inputs)'!C220,\"\")","v":"Kosten (Angabe pro Fahrzeug)"},null,{"$f":"IF('Eingaben (Inputs)'!E220<>\"\",'Eingaben (Inputs)'!E220,\"\")","v":""}]
[null,null,{"$f":"IF('Eingaben (Inputs)'!C221<>\"\",'Eingaben (Inputs)'!C221,\"\")","v":"Laufzeit"},{"$f":"'Eingaben (Inputs)'!D221","v":48},{"$f":"IF('Eingaben (Inputs)'!E221<>\"\",'Eingaben (Inputs)'!E221,\"\")","v":"Monate"}]
[null,null,{"$f":"IF('Eingaben (Inputs)'!C222<>\"\",'Eingaben (Inputs)'!C222,\"\")","v":"Leasing-Zinssatz"},{"v":0.03,"d":"3.0%"},{"$f":"IF('Eingaben (Inputs)'!E222<>\"\",'Eingaben (Inputs)'!E222,\"\")","v":""},{"$f":"\"Standardwert: \"&TEXT('1a. Defaults Segment-Ebene'!D222,\"##0.0%\")","v":"Standardwert: 3.0%"}]
[null,null,{"$f":"IF('Eingaben (Inputs)'!C223<>\"\",'Eingaben (Inputs)'!C223,\"\")","v":"Anschaffungspreis inkl. Flottenrabatt Verbrenner"},{"$f":"INDEX('2d. Annahmen'!$H$13:$H$16,_xlfn.XMATCH(D204,'2d. Annahmen'!$B$4:$B$7))*(1-'2d. Annahmen'!$B$30)","v":{"v":27219.464999999997,"d":"27,219"}},{"$f":"IF('Eingaben (Inputs)'!E223<>\"\",'Eingaben (Inputs)'!E223,\"\")","v":"CHF"},{"$f":"\"Standardwert: \"&TEXT('1a. Defaults Segment-Ebene'!D223,\"#’##0\")&\" \"&E223","v":"Standardwert: 27’219 CHF"}]
[null,null,{"$f":"IF('Eingaben (Inputs)'!C224<>\"\",'Eingaben (Inputs)'!C224,\"\")","v":"Service- und Reparaturkosten Verbrenner"},{"$f":"INDEX('2d. Annahmen'!$J$13:$J$16,_xlfn.XMATCH(D204,Grösse))/20000","v":0.05},{"$f":"IF('Eingaben (Inputs)'!E224<>\"\",'Eingaben (Inputs)'!E224,\"\")","v":"CHF/km"},{"$f":"\"Standardwert: \"&TEXT('1a. Defaults Segment-Ebene'!D224,\"##0.000\")&\" \"&E224","v":"Standardwert: 0.050 CHF/km"}]
[null,null,{"$f":"IF('Eingaben (Inputs)'!C225<>\"\",'Eingaben (Inputs)'!C225,\"\")","v":"Restwert Verbrenner"},{"$f":"_xlfn.LET(_xlpm.class,D204,_xlpm.km,ROUNDUP(D211*IF(D198=INDEX(Einsatzart,1),D212,D212+D213)*D221/12/5000,0)*5000,_xlpm.lz,D221,_xlpm.totkm,'2d. Annahmen'!$B$76:$G$76,_xlpm.totlz,'2d. Annahmen'!$A$77:$A$82,_xlpm.rkm,MIN(MAX(_xlpm.km,MIN(_xlpm.totkm)),MAX(_xlpm.totkm)),_xlpm.r,_xlfn.XMATCH(_xlpm.lz,_xlpm.totlz),_xlpm.c,_xlfn.XMATCH(_xlpm.rkm,_xlpm.totkm),_xlpm.delta,1+INDEX('2d. Annahmen'!$K$13:$K$16,_xlfn.XMATCH(_xlpm.class,Grösse)),_xlpm.delta*INDEX('2d. Annahmen'!$B$77:$G$82,_xlpm.r,_xlpm.c))","v":{"v":0.31606388888888887,"d":"32%"}},{"$f":"IF('Eingaben (Inputs)'!E225<>\"\",'Eingaben (Inputs)'!E225,\"\")","v":""},{"$f":"\"Standardwert: \"&TEXT('1a. Defaults Segment-Ebene'!D225,\"##0.0%\")","v":"Standardwert: 31.6%"}]
[null,null,{"$f":"IF('Eingaben (Inputs)'!C226<>\"\",'Eingaben (Inputs)'!C226,\"\")","v":"Anschaffungspreis inkl. Flottenrabatt E-Fahrzeug"},{"$f":"INDEX('2d. Annahmen'!$K$4:$K$7,_xlfn.XMATCH(D204,'2d. Annahmen'!$B$4:$B$7))*(1-'2d. Annahmen'!$B$29)","v":{"v":28810.890000000003,"d":"28,811"}},{"$f":"IF('Eingaben (Inputs)'!E226<>\"\",'Eingaben (Inputs)'!E226,\"\")","v":"CHF"},{"$f":"\"Standardwert: \"&TEXT('1a. Defaults Segment-Ebene'!D226,\"#’##0\")&\" \"&E226","v":"Standardwert: 28’811 CHF"}]
[null,null,{"$f":"IF('Eingaben (Inputs)'!C227<>\"\",'Eingaben (Inputs)'!C227,\"\")","v":"Service- und Reparaturkosten E-Fahrzeug"},{"$f":"D224*0.5","v":0.025},{"$f":"IF('Eingaben (Inputs)'!E227<>\"\",'Eingaben (Inputs)'!E227,\"\")","v":"CHF/km"},{"$f":"\"Standardwert: \"&TEXT('1a. Defaults Segment-Ebene'!D227,\"0.000\")&\" \"&E227","v":"Standardwert: 0.025 CHF/km"}]
[null,null,{"$f":"IF('Eingaben (Inputs)'!C228<>\"\",'Eingaben (Inputs)'!C228,\"\")","v":"Restwert E-Fahrzeug"},{"$f":"_xlfn.LET(_xlpm.class,D204,_xlpm.km,ROUNDUP(D211*IF(D198=INDEX(Einsatzart,1),D212,D212+D213)*D221/12/5000,0)*5000,_xlpm.lz,D221,_xlpm.totkm,'2d. Annahmen'!$B$76:$G$76,_xlpm.totlz,'2d. Annahmen'!$A$77:$A$82,_xlpm.rkm,MIN(MAX(_xlpm.km,MIN(_xlpm.totkm)),MAX(_xlpm.totkm)),_xlpm.r,_xlfn.XMATCH(_xlpm.lz,_xlpm.totlz),_xlpm.c,_xlfn.XMATCH(_xlpm.rkm,_xlpm.totkm),_xlpm.delta,1+INDEX('2d. Annahmen'!$N$4:$N$7,_xlfn.XMATCH(_xlpm.class,Grösse)),_xlpm.delta*INDEX('2d. Annahmen'!$B$77:$G$82,_xlpm.r,_xlpm.c))","v":{"v":0.30658197222222217,"d":"31%"}},{"$f":"IF('Eingaben (Inputs)'!E228<>\"\",'Eingaben (Inputs)'!E228,\"\")","v":""},{"$f":"\"Standardwert: \"&TEXT('1a. Defaults Segment-Ebene'!D228,\"##0.0%\")","v":"Standardwert: 30.7%"}]
[null,null,{"$f":"IF('Eingaben (Inputs)'!C229<>\"\",'Eingaben (Inputs)'!C229,\"\")","v":""},null,{"$f":"IF('Eingaben (Inputs)'!E229<>\"\",'Eingaben (Inputs)'!E229,\"\")","v":""}]
[null,null,{"$f":"IF('Eingaben (Inputs)'!C230<>\"\",'Eingaben (Inputs)'!C230,\"\")","v":""},null,{"$f":"IF('Eingaben (Inputs)'!E230<>\"\",'Eingaben (Inputs)'!E230,\"\")","v":""}]
[null,"2.7)",{"$f":"IF('Eingaben (Inputs)'!C231<>\"\",'Eingaben (Inputs)'!C231,\"\")","v":"Segment G"},null,{"$f":"IF('Eingaben (Inputs)'!E231<>\"\",'Eingaben (Inputs)'!E231,\"\")","v":""}]
[null,null,{"$f":"IF('Eingaben (Inputs)'!C232<>\"\",'Eingaben (Inputs)'!C232,\"\")","v":""},null,{"$f":"IF('Eingaben (Inputs)'!E232<>\"\",'Eingaben (Inputs)'!E232,\"\")","v":""}]
[null,null,{"$f":"IF('Eingaben (Inputs)'!C233<>\"\",'Eingaben (Inputs)'!C233,\"\")","v":"Segmentstruktur"},null,{"$f":"IF('Eingaben (Inputs)'!E233<>\"\",'Eingaben (Inputs)'!E233,\"\")","v":""}]
[null,null,{"$f":"IF('Eingaben (Inputs)'!C234<>\"\",'Eingaben (Inputs)'!C234,\"\")","v":"Anzahl Fahrzeuge"},{"$f":"'Eingaben (Inputs)'!D234","v":1},{"$f":"IF('Eingaben (Inputs)'!E234<>\"\",'Eingaben (Inputs)'!E234,\"\")","v":""}]
[null,null,{"$f":"IF('Eingaben (Inputs)'!C235<>\"\",'Eingaben (Inputs)'!C235,\"\")","v":"Einsatzart"},{"$f":"'Eingaben (Inputs)'!D235","v":"Poolfahrzeuge"},{"$f":"IF('Eingaben (Inputs)'!E235<>\"\",'Eingaben (Inputs)'!E235,\"\")","v":""}]
[null,null,{"$f":"IF('Eingaben (Inputs)'!C236<>\"\",'Eingaben (Inputs)'!C236,\"\")","v":"Einsatzgebiet"},{"$f":"'Eingaben (Inputs)'!D236","v":"regional"},{"$f":"IF('Eingaben (Inputs)'!E236<>\"\",'Eingaben (Inputs)'!E236,\"\")","v":""}]
[null,null,{"$f":"IF('Eingaben (Inputs)'!C237<>\"\",'Eingaben (Inputs)'!C237,\"\")","v":"Heimlademöglichkeit"},{"$f":"INDEX(Heimladen,NOT(_xlfn.XMATCH(D235,Einsatzart)-1)+1)","v":"Nein"},{"$f":"IF('Eingaben (Inputs)'!E237<>\"\",'Eingaben (Inputs)'!E237,\"\")","v":""},{"$f":"\"Standardwert: \"&'1a. Defaults Segment-Ebene'!D237","v":"Standardwert: Nein"}]
[null,null,{"$f":"IF('Eingaben (Inputs)'!C238<>\"\",'Eingaben (Inputs)'!C238,\"\")","v":""},null,{"$f":"IF('Eingaben (Inputs)'!E238<>\"\",'Eingaben (Inputs)'!E238,\"\")","v":""}]
[null,null,{"$f":"IF('Eingaben (Inputs)'!C239<>\"\",'Eingaben (Inputs)'!C239,\"\")","v":"Fahrzeugdaten"},null,{"$f":"IF('Eingaben (Inputs)'!E239<>\"\",'Eingaben (Inputs)'!E239,\"\")","v":""}]
[null,null,{"$f":"IF('Eingaben (Inputs)'!C240<>\"\",'Eingaben (Inputs)'!C240,\"\")","v":"Fahrzeuggrösse"},{"$f":"'Eingaben (Inputs)'!D240","v":"Mittelklasse"},{"$f":"IF('Eingaben (Inputs)'!E240<>\"\",'Eingaben (Inputs)'!E240,\"\")","v":""}]
[null,null,{"$f":"IF('Eingaben (Inputs)'!C241<>\"\",'Eingaben (Inputs)'!C241,\"\")","v":"Treibstoffverbrauch Verbrenner"},{"$f":"INDEX('2d. Annahmen'!$F$13:$F$16,_xlfn.XMATCH(D240,Grösse))","v":5.8},{"$f":"IF('Eingaben (Inputs)'!E241<>\"\",'Eingaben (Inputs)'!E241,\"\")","v":"l/100 km"},{"$f":"\"Standardwert: \"&TEXT('1a. Defaults Segment-Ebene'!D241,\"##0.0\")&\" \"&E241","v":"Standardwert: 5.8 l/100 km"}]
[null,null,{"$f":"IF('Eingaben (Inputs)'!C242<>\"\",'Eingaben (Inputs)'!C242,\"\")","v":"Energieverbrauch E-Fahrzeug"},{"$f":"INDEX('2d. Annahmen'!$H$4:$H$7,_xlfn.XMATCH(D240,Grösse))","v":15.1},{"$f":"IF('Eingaben (Inputs)'!E242<>\"\",'Eingaben (Inputs)'!E242,\"\")","v":"kWh/100 km"},{"$f":"\"Standardwert: \"&TEXT('1a. Defaults Segment-Ebene'!D242,\"##0.0\")&\" \"&E242","v":"Standardwert: 15.1 kWh/100 km"}]
[null,null,{"$f":"IF('Eingaben (Inputs)'!C243<>\"\",'Eingaben (Inputs)'!C243,\"\")","v":"Batteriekapazität (netto)"},{"$f":"INDEX('2d. Annahmen'!$F$4:$F$7,_xlfn.XMATCH(D240,Grösse))","v":58.625},{"$f":"IF('Eingaben (Inputs)'!E243<>\"\",'Eingaben (Inputs)'!E243,\"\")","v":"kWh"},{"$f":"\"Standardwert: \"&TEXT('1a. Defaults Segment-Ebene'!D243,\"##0.0\")&\" \"&E243","v":"Standardwert: 58.6 kWh"}]
[null,null,{"$f":"IF('Eingaben (Inputs)'!C244<>\"\",'Eingaben (Inputs)'!C244,\"\")","v":""},null,{"$f":"IF('Eingaben (Inputs)'!E244<>\"\",'Eingaben (Inputs)'!E244,\"\")","v":""}]
[null,null,{"$f":"IF('Eingaben (Inputs)'!C245<>\"\",'Eingaben (Inputs)'!C245,\"\")","v":"Fahr- und Nutzungsprofil (Angabe pro Fahrzeug)"},null,{"$f":"IF('Eingaben (Inputs)'!E245<>\"\",'Eingaben (Inputs)'!E245,\"\")","v":""}]
[null,null,{"$f":"IF('Eingaben (Inputs)'!C246<>\"\",'Eingaben (Inputs)'!C246,\"\")","v":"Nutzungsmuster"},{"$f":"'Eingaben (Inputs)'!D246","v":"Werktagsbetrieb"},{"$f":"IF('Eingaben (Inputs)'!E246<>\"\",'Eingaben (Inputs)'!E246,\"\")","v":""}]
[null,null,{"$f":"IF('Eingaben (Inputs)'!C247<>\"\",'Eingaben (Inputs)'!C247,\"\")","v":"Anzahl Arbeitstage pro Jahr"},{"$f":"INDEX('1e. Dropdown Values'!$A$7:$D$7,_xlfn.XMATCH(D246,'1e. Dropdown Values'!$A$6:$D$6))","v":260},{"$f":"IF('Eingaben (Inputs)'!E247<>\"\",'Eingaben (Inputs)'!E247,\"\")","v":""},{"$f":"\"Standardwert: \"&TEXT('1a. Defaults Segment-Ebene'!D247,\"##0\")","v":"Standardwert: 260"}]
[null,null,{"$f":"IF('Eingaben (Inputs)'!C248<>\"\",'Eingaben (Inputs)'!C248,\"\")","v":"Fahrdistanz während der Arbeitszeit"},{"$f":"INDEX('1e. Dropdown Values'!$A$4:$D$4,_xlfn.XMATCH(D236,'1e. Dropdown Values'!$A$3:$D$3))","v":100},{"$f":"IF('Eingaben (Inputs)'!E248<>\"\",'Eingaben (Inputs)'!E248,\"\")","v":"km/Tag"},{"$f":"\"Standardwert: \"&TEXT('1a. Defaults Segment-Ebene'!D248,\"##0\")&\" \"&E248","v":"Standardwert: 100 km/Tag"}]
[null,null,{"$f":"IF('Eingaben (Inputs)'!C249<>\"\",'Eingaben (Inputs)'!C249,\"\")","v":"Pendeldistanz (Hin- und Rückfahrt)"},{"$f":"(_xlfn.XMATCH(D235,Einsatzart)-1)*30","v":0},{"$f":"IF('Eingaben (Inputs)'!E249<>\"\",'Eingaben (Inputs)'!E249,\"\")","v":"km/Tag"},{"$f":"\"Standardwert: \"&TEXT('1a. Defaults Segment-Ebene'!D249,\"##0\")&\" \"&E249","v":"Standardwert: 0 km/Tag"}]
[null,null,{"$f":"IF('Eingaben (Inputs)'!C250<>\"\",'Eingaben (Inputs)'!C250,\"\")","v":"Anzahl Einsätze pro Tag"},1,{"$f":"IF('Eingaben (Inputs)'!E250<>\"\",'Eingaben (Inputs)'!E250,\"\")","v":""},{"$f":"\"Standardwert: \"&TEXT('1a. Defaults Segment-Ebene'!D250,\"##0\")","v":"Standardwert: 1"}]
[null,null,{"$f":"IF('Eingaben (Inputs)'!C251<>\"\",'Eingaben (Inputs)'!C251,\"\")","v":"Anzahl Pausen pro Tag"},null,{"$f":"IF('Eingaben (Inputs)'!E251<>\"\",'Eingaben (Inputs)'!E251,\"\")","v":""}]
[null,null,{"$f":"IF('Eingaben (Inputs)'!C252<>\"\",'Eingaben (Inputs)'!C252,\"\")","v":"Standzeit pro Pause am Firmenstandort"},{"$f":"INDEX('1e. Dropdown Values'!$A$9:$D$9,_xlfn.XMATCH(D246,'1e. Dropdown Values'!$A$6:$D$6))","v":1},{"$f":"IF('Eingaben (Inputs)'!E252<>\"\",'Eingaben (Inputs)'!E252,\"\")","v":"Stunden"},{"$f":"\"Standardwert: \"&TEXT('1a. Defaults Segment-Ebene'!D252,\"##0\")&\" \"&IF(D252=1,\"Stunde\",E252)","v":"Standardwert: 1 Stunde"}]
[null,null,{"$f":"IF('Eingaben (Inputs)'!C253<>\"\",'Eingaben (Inputs)'!C253,\"\")","v":"Standzeit über Nacht"},{"$f":"INDEX('1e. Dropdown Values'!$A$8:$D$8,_xlfn.XMATCH(D246,'1e. Dropdown Values'!$A$6:$D$6))","v":8},{"$f":"IF('Eingaben (Inputs)'!E253<>\"\",'Eingaben (Inputs)'!E253,\"\")","v":"Stunden"},{"$f":"\"Standardwert: \"&TEXT('1a. Defaults Segment-Ebene'!D253,\"##0\")&\" \"&IF(D253=1,\"Stunde\",E253)","v":"Standardwert: 8 Stunden"}]
[null,null,{"$f":"IF('Eingaben (Inputs)'!C254<>\"\",'Eingaben (Inputs)'!C254,\"\")","v":"Fahrzeuge pro Ladepunkt, Firmenstandort (tagsüber)"},{"$f":"INDEX('1e. Dropdown Values'!$B$10:$D$10,_xlfn.XMATCH(D246,Nutzungsmuster))","v":1},{"$f":"IF('Eingaben (Inputs)'!E254<>\"\",'Eingaben (Inputs)'!E254,\"\")","v":""},{"$f":"\"Standardwert: \"&TEXT('1a. Defaults Segment-Ebene'!D254,\"##0\")","v":"Standardwert: 1"}]
[null,null,{"$f":"IF('Eingaben (Inputs)'!C255<>\"\",'Eingaben (Inputs)'!C255,\"\")","v":""},null,{"$f":"IF('Eingaben (Inputs)'!E255<>\"\",'Eingaben (Inputs)'!E255,\"\")","v":""}]
[null,null,{"$f":"IF('Eingaben (Inputs)'!C256<>\"\",'Eingaben (Inputs)'!C256,\"\")","v":"Kosten (Angabe pro Fahrzeug)"},null,{"$f":"IF('Eingaben (Inputs)'!E256<>\"\",'Eingaben (Inputs)'!E256,\"\")","v":""}]
[null,null,{"$f":"IF('Eingaben (Inputs)'!C257<>\"\",'Eingaben (Inputs)'!C257,\"\")","v":"Laufzeit"},{"$f":"'Eingaben (Inputs)'!D257","v":48},{"$f":"IF('Eingaben (Inputs)'!E257<>\"\",'Eingaben (Inputs)'!E257,\"\")","v":"Monate"}]
[null,null,{"$f":"IF('Eingaben (Inputs)'!C258<>\"\",'Eingaben (Inputs)'!C258,\"\")","v":"Leasing-Zinssatz"},{"v":0.03,"d":"3.0%"},{"$f":"IF('Eingaben (Inputs)'!E258<>\"\",'Eingaben (Inputs)'!E258,\"\")","v":""},{"$f":"\"Standardwert: \"&TEXT('1a. Defaults Segment-Ebene'!D258,\"##0.0%\")","v":"Standardwert: 3.0%"}]
[null,null,{"$f":"IF('Eingaben (Inputs)'!C259<>\"\",'Eingaben (Inputs)'!C259,\"\")","v":"Anschaffungspreis inkl. Flottenrabatt Verbrenner"},{"$f":"INDEX('2d. Annahmen'!$H$13:$H$16,_xlfn.XMATCH(D240,'2d. Annahmen'!$B$4:$B$7))*(1-'2d. Annahmen'!$B$30)","v":{"v":27219.464999999997,"d":"27,219"}},{"$f":"IF('Eingaben (Inputs)'!E259<>\"\",'Eingaben (Inputs)'!E259,\"\")","v":"CHF"},{"$f":"\"Standardwert: \"&TEXT('1a. Defaults Segment-Ebene'!D259,\"#’##0\")&\" \"&E259","v":"Standardwert: 27’219 CHF"}]
[null,null,{"$f":"IF('Eingaben (Inputs)'!C260<>\"\",'Eingaben (Inputs)'!C260,\"\")","v":"Service- und Reparaturkosten Verbrenner"},{"$f":"INDEX('2d. Annahmen'!$J$13:$J$16,_xlfn.XMATCH(D240,Grösse))/20000","v":0.05},{"$f":"IF('Eingaben (Inputs)'!E260<>\"\",'Eingaben (Inputs)'!E260,\"\")","v":"CHF/km"},{"$f":"\"Standardwert: \"&TEXT('1a. Defaults Segment-Ebene'!D260,\"##0.000\")&\" \"&E260","v":"Standardwert: 0.050 CHF/km"}]
[null,null,{"$f":"IF('Eingaben (Inputs)'!C261<>\"\",'Eingaben (Inputs)'!C261,\"\")","v":"Restwert Verbrenner"},{"$f":"_xlfn.LET(_xlpm.class,D240,_xlpm.km,ROUNDUP(D247*IF(D234=INDEX(Einsatzart,1),D248,D248+D249)*D257/12/5000,0)*5000,_xlpm.lz,D257,_xlpm.totkm,'2d. Annahmen'!$B$76:$G$76,_xlpm.totlz,'2d. Annahmen'!$A$77:$A$82,_xlpm.rkm,MIN(MAX(_xlpm.km,MIN(_xlpm.totkm)),MAX(_xlpm.totkm)),_xlpm.r,_xlfn.XMATCH(_xlpm.lz,_xlpm.totlz),_xlpm.c,_xlfn.XMATCH(_xlpm.rkm,_xlpm.totkm),_xlpm.delta,1+INDEX('2d. Annahmen'!$K$13:$K$16,_xlfn.XMATCH(_xlpm.class,Grösse)),_xlpm.delta*INDEX('2d. Annahmen'!$B$77:$G$82,_xlpm.r,_xlpm.c))","v":{"v":0.31606388888888887,"d":"32%"}},{"$f":"IF('Eingaben (Inputs)'!E261<>\"\",'Eingaben (Inputs)'!E261,\"\")","v":""},{"$f":"\"Standardwert: \"&TEXT('1a. Defaults Segment-Ebene'!D261,\"##0.0%\")","v":"Standardwert: 31.6%"}]
[null,null,{"$f":"IF('Eingaben (Inputs)'!C262<>\"\",'Eingaben (Inputs)'!C262,\"\")","v":"Anschaffungspreis inkl. Flottenrabatt E-Fahrzeug"},{"$f":"INDEX('2d. Annahmen'!$K$4:$K$7,_xlfn.XMATCH(D240,'2d. Annahmen'!$B$4:$B$7))*(1-'2d. Annahmen'!$B$29)","v":{"v":28810.890000000003,"d":"28,811"}},{"$f":"IF('Eingaben (Inputs)'!E262<>\"\",'Eingaben (Inputs)'!E262,\"\")","v":"CHF"},{"$f":"\"Standardwert: \"&TEXT('1a. Defaults Segment-Ebene'!D262,\"#’##0\")&\" \"&E262","v":"Standardwert: 28’811 CHF"}]
[null,null,{"$f":"IF('Eingaben (Inputs)'!C263<>\"\",'Eingaben (Inputs)'!C263,\"\")","v":"Service- und Reparaturkosten E-Fahrzeug"},{"$f":"D260*0.5","v":0.025},{"$f":"IF('Eingaben (Inputs)'!E263<>\"\",'Eingaben (Inputs)'!E263,\"\")","v":"CHF/km"},{"$f":"\"Standardwert: \"&TEXT('1a. Defaults Segment-Ebene'!D263,\"0.000\")&\" \"&E263","v":"Standardwert: 0.025 CHF/km"}]
[null,null,{"$f":"IF('Eingaben (Inputs)'!C264<>\"\",'Eingaben (Inputs)'!C264,\"\")","v":"Restwert E-Fahrzeug"},{"$f":"_xlfn.LET(_xlpm.class,D240,_xlpm.km,ROUNDUP(D247*IF(D234=INDEX(Einsatzart,1),D248,D248+D249)*D257/12/5000,0)*5000,_xlpm.lz,D257,_xlpm.totkm,'2d. Annahmen'!$B$76:$G$76,_xlpm.totlz,'2d. Annahmen'!$A$77:$A$82,_xlpm.rkm,MIN(MAX(_xlpm.km,MIN(_xlpm.totkm)),MAX(_xlpm.totkm)),_xlpm.r,_xlfn.XMATCH(_xlpm.lz,_xlpm.totlz),_xlpm.c,_xlfn.XMATCH(_xlpm.rkm,_xlpm.totkm),_xlpm.delta,1+INDEX('2d. Annahmen'!$N$4:$N$7,_xlfn.XMATCH(_xlpm.class,Grösse)),_xlpm.delta*INDEX('2d. Annahmen'!$B$77:$G$82,_xlpm.r,_xlpm.c))","v":{"v":0.30658197222222217,"d":"31%"}},{"$f":"IF('Eingaben (Inputs)'!E264<>\"\",'Eingaben (Inputs)'!E264,\"\")","v":""},{"$f":"\"Standardwert: \"&TEXT('1a. Defaults Segment-Ebene'!D264,\"##0.0%\")","v":"Standardwert: 30.7%"}]
[null,null,{"$f":"IF('Eingaben (Inputs)'!C265<>\"\",'Eingaben (Inputs)'!C265,\"\")","v":""},null,{"$f":"IF('Eingaben (Inputs)'!E265<>\"\",'Eingaben (Inputs)'!E265,\"\")","v":""}]
[null,null,{"$f":"IF('Eingaben (Inputs)'!C266<>\"\",'Eingaben (Inputs)'!C266,\"\")","v":""},null,{"$f":"IF('Eingaben (Inputs)'!E266<>\"\",'Eingaben (Inputs)'!E266,\"\")","v":""}]
[null,"2.8)",{"$f":"IF('Eingaben (Inputs)'!C267<>\"\",'Eingaben (Inputs)'!C267,\"\")","v":"Segment H"},null,{"$f":"IF('Eingaben (Inputs)'!E267<>\"\",'Eingaben (Inputs)'!E267,\"\")","v":""}]
[null,null,{"$f":"IF('Eingaben (Inputs)'!C268<>\"\",'Eingaben (Inputs)'!C268,\"\")","v":""},null,{"$f":"IF('Eingaben (Inputs)'!E268<>\"\",'Eingaben (Inputs)'!E268,\"\")","v":""}]
[null,null,{"$f":"IF('Eingaben (Inputs)'!C269<>\"\",'Eingaben (Inputs)'!C269,\"\")","v":"Segmentstruktur"},null,{"$f":"IF('Eingaben (Inputs)'!E269<>\"\",'Eingaben (Inputs)'!E269,\"\")","v":""}]
[null,null,{"$f":"IF('Eingaben (Inputs)'!C270<>\"\",'Eingaben (Inputs)'!C270,\"\")","v":"Anzahl Fahrzeuge"},{"$f":"'Eingaben (Inputs)'!D270","v":1},{"$f":"IF('Eingaben (Inputs)'!E270<>\"\",'Eingaben (Inputs)'!E270,\"\")","v":""}]
[null,null,{"$f":"IF('Eingaben (Inputs)'!C271<>\"\",'Eingaben (Inputs)'!C271,\"\")","v":"Einsatzart"},{"$f":"'Eingaben (Inputs)'!D271","v":"Poolfahrzeuge"},{"$f":"IF('Eingaben (Inputs)'!E271<>\"\",'Eingaben (Inputs)'!E271,\"\")","v":""}]
[null,null,{"$f":"IF('Eingaben (Inputs)'!C272<>\"\",'Eingaben (Inputs)'!C272,\"\")","v":"Einsatzgebiet"},{"$f":"'Eingaben (Inputs)'!D272","v":"regional"},{"$f":"IF('Eingaben (Inputs)'!E272<>\"\",'Eingaben (Inputs)'!E272,\"\")","v":""}]
[null,null,{"$f":"IF('Eingaben (Inputs)'!C273<>\"\",'Eingaben (Inputs)'!C273,\"\")","v":"Heimlademöglichkeit"},{"$f":"INDEX(Heimladen,NOT(_xlfn.XMATCH(D271,Einsatzart)-1)+1)","v":"Nein"},{"$f":"IF('Eingaben (Inputs)'!E273<>\"\",'Eingaben (Inputs)'!E273,\"\")","v":""},{"$f":"\"Standardwert: \"&'1a. Defaults Segment-Ebene'!D273","v":"Standardwert: Nein"}]
[null,null,{"$f":"IF('Eingaben (Inputs)'!C274<>\"\",'Eingaben (Inputs)'!C274,\"\")","v":""},null,{"$f":"IF('Eingaben (Inputs)'!E274<>\"\",'Eingaben (Inputs)'!E274,\"\")","v":""}]
[null,null,{"$f":"IF('Eingaben (Inputs)'!C275<>\"\",'Eingaben (Inputs)'!C275,\"\")","v":"Fahrzeugdaten"},null,{"$f":"IF('Eingaben (Inputs)'!E275<>\"\",'Eingaben (Inputs)'!E275,\"\")","v":""}]
[null,null,{"$f":"IF('Eingaben (Inputs)'!C276<>\"\",'Eingaben (Inputs)'!C276,\"\")","v":"Fahrzeuggrösse"},{"$f":"'Eingaben (Inputs)'!D276","v":"Mittelklasse"},{"$f":"IF('Eingaben (Inputs)'!E276<>\"\",'Eingaben (Inputs)'!E276,\"\")","v":""}]
[null,null,{"$f":"IF('Eingaben (Inputs)'!C277<>\"\",'Eingaben (Inputs)'!C277,\"\")","v":"Treibstoffverbrauch Verbrenner"},{"$f":"INDEX('2d. Annahmen'!$F$13:$F$16,_xlfn.XMATCH(D276,Grösse))","v":5.8},{"$f":"IF('Eingaben (Inputs)'!E277<>\"\",'Eingaben (Inputs)'!E277,\"\")","v":"l/100 km"},{"$f":"\"Standardwert: \"&TEXT('1a. Defaults Segment-Ebene'!D277,\"##0.0\")&\" \"&E277","v":"Standardwert: 5.8 l/100 km"}]
[null,null,{"$f":"IF('Eingaben (Inputs)'!C278<>\"\",'Eingaben (Inputs)'!C278,\"\")","v":"Energieverbrauch E-Fahrzeug"},{"$f":"INDEX('2d. Annahmen'!$H$4:$H$7,_xlfn.XMATCH(D276,Grösse))","v":15.1},{"$f":"IF('Eingaben (Inputs)'!E278<>\"\",'Eingaben (Inputs)'!E278,\"\")","v":"kWh/100 km"},{"$f":"\"Standardwert: \"&TEXT('1a. Defaults Segment-Ebene'!D278,\"##0.0\")&\" \"&E278","v":"Standardwert: 15.1 kWh/100 km"}]
[null,null,{"$f":"IF('Eingaben (Inputs)'!C279<>\"\",'Eingaben (Inputs)'!C279,\"\")","v":"Batteriekapazität (netto)"},{"$f":"INDEX('2d. Annahmen'!$F$4:$F$7,_xlfn.XMATCH(D276,Grösse))","v":58.625},{"$f":"IF('Eingaben (Inputs)'!E279<>\"\",'Eingaben (Inputs)'!E279,\"\")","v":"kWh"},{"$f":"\"Standardwert: \"&TEXT('1a. Defaults Segment-Ebene'!D279,\"##0.0\")&\" \"&E279","v":"Standardwert: 58.6 kWh"}]
[null,null,{"$f":"IF('Eingaben (Inputs)'!C280<>\"\",'Eingaben (Inputs)'!C280,\"\")","v":""},null,{"$f":"IF('Eingaben (Inputs)'!E280<>\"\",'Eingaben (Inputs)'!E280,\"\")","v":""}]
[null,null,{"$f":"IF('Eingaben (Inputs)'!C281<>\"\",'Eingaben (Inputs)'!C281,\"\")","v":"Fahr- und Nutzungsprofil (Angabe pro Fahrzeug)"},null,{"$f":"IF('Eingaben (Inputs)'!E281<>\"\",'Eingaben (Inputs)'!E281,\"\")","v":""}]
[null,null,{"$f":"IF('Eingaben (Inputs)'!C282<>\"\",'Eingaben (Inputs)'!C282,\"\")","v":"Nutzungsmuster"},{"$f":"'Eingaben (Inputs)'!D282","v":"Werktagsbetrieb"},{"$f":"IF('Eingaben (Inputs)'!E282<>\"\",'Eingaben (Inputs)'!E282,\"\")","v":""}]
[null,null,{"$f":"IF('Eingaben (Inputs)'!C283<>\"\",'Eingaben (Inputs)'!C283,\"\")","v":"Anzahl Arbeitstage pro Jahr"},{"$f":"INDEX('1e. Dropdown Values'!$A$7:$D$7,_xlfn.XMATCH(D282,'1e. Dropdown Values'!$A$6:$D$6))","v":260},{"$f":"IF('Eingaben (Inputs)'!E283<>\"\",'Eingaben (Inputs)'!E283,\"\")","v":""},{"$f":"\"Standardwert: \"&TEXT('1a. Defaults Segment-Ebene'!D283,\"##0\")","v":"Standardwert: 260"}]
[null,null,{"$f":"IF('Eingaben (Inputs)'!C284<>\"\",'Eingaben (Inputs)'!C284,\"\")","v":"Fahrdistanz während der Arbeitszeit"},{"$f":"INDEX('1e. Dropdown Values'!$A$4:$D$4,_xlfn.XMATCH(D272,'1e. Dropdown Values'!$A$3:$D$3))","v":100},{"$f":"IF('Eingaben (Inputs)'!E284<>\"\",'Eingaben (Inputs)'!E284,\"\")","v":"km/Tag"},{"$f":"\"Standardwert: \"&TEXT('1a. Defaults Segment-Ebene'!D284,\"##0\")&\" \"&E284","v":"Standardwert: 100 km/Tag"}]
[null,null,{"$f":"IF('Eingaben (Inputs)'!C285<>\"\",'Eingaben (Inputs)'!C285,\"\")","v":"Pendeldistanz (Hin- und Rückfahrt)"},{"$f":"(_xlfn.XMATCH(D271,Einsatzart)-1)*30","v":0},{"$f":"IF('Eingaben (Inputs)'!E285<>\"\",'Eingaben (Inputs)'!E285,\"\")","v":"km/Tag"},{"$f":"\"Standardwert: \"&TEXT('1a. Defaults Segment-Ebene'!D285,\"##0\")&\" \"&E285","v":"Standardwert: 0 km/Tag"}]
[null,null,{"$f":"IF('Eingaben (Inputs)'!C286<>\"\",'Eingaben (Inputs)'!C286,\"\")","v":"Anzahl Einsätze pro Tag"},1,{"$f":"IF('Eingaben (Inputs)'!E286<>\"\",'Eingaben (Inputs)'!E286,\"\")","v":""},{"$f":"\"Standardwert: \"&TEXT('1a. Defaults Segment-Ebene'!D286,\"##0\")","v":"Standardwert: 1"}]
[null,null,{"$f":"IF('Eingaben (Inputs)'!C287<>\"\",'Eingaben (Inputs)'!C287,\"\")","v":"Anzahl Pausen pro Tag"},null,{"$f":"IF('Eingaben (Inputs)'!E287<>\"\",'Eingaben (Inputs)'!E287,\"\")","v":""}]
[null,null,{"$f":"IF('Eingaben (Inputs)'!C288<>\"\",'Eingaben (Inputs)'!C288,\"\")","v":"Standzeit pro Pause am Firmenstandort"},{"$f":"INDEX('1e. Dropdown Values'!$A$9:$D$9,_xlfn.XMATCH(D282,'1e. Dropdown Values'!$A$6:$D$6))","v":1},{"$f":"IF('Eingaben (Inputs)'!E288<>\"\",'Eingaben (Inputs)'!E288,\"\")","v":"Stunden"},{"$f":"\"Standardwert: \"&TEXT('1a. Defaults Segment-Ebene'!D288,\"##0\")&\" \"&IF(D288=1,\"Stunde\",E288)","v":"Standardwert: 1 Stunde"}]
[null,null,{"$f":"IF('Eingaben (Inputs)'!C289<>\"\",'Eingaben (Inputs)'!C289,\"\")","v":"Standzeit über Nacht"},{"$f":"INDEX('1e. Dropdown Values'!$A$8:$D$8,_xlfn.XMATCH(D282,'1e. Dropdown Values'!$A$6:$D$6))","v":8},{"$f":"IF('Eingaben (Inputs)'!E289<>\"\",'Eingaben (Inputs)'!E289,\"\")","v":"Stunden"},{"$f":"\"Standardwert: \"&TEXT('1a. Defaults Segment-Ebene'!D289,\"##0\")&\" \"&IF(D289=1,\"Stunde\",E289)","v":"Standardwert: 8 Stunden"}]
[null,null,{"$f":"IF('Eingaben (Inputs)'!C290<>\"\",'Eingaben (Inputs)'!C290,\"\")","v":"Fahrzeuge pro Ladepunkt, Firmenstandort (tagsüber)"},{"$f":"INDEX('1e. Dropdown Values'!$B$10:$D$10,_xlfn.XMATCH(D282,Nutzungsmuster))","v":1},{"$f":"IF('Eingaben (Inputs)'!E290<>\"\",'Eingaben (Inputs)'!E290,\"\")","v":""},{"$f":"\"Standardwert: \"&TEXT('1a. Defaults Segment-Ebene'!D290,\"##0\")","v":"Standardwert: 1"}]
[null,null,{"$f":"IF('Eingaben (Inputs)'!C291<>\"\",'Eingaben (Inputs)'!C291,\"\")","v":""},null,{"$f":"IF('Eingaben (Inputs)'!E291<>\"\",'Eingaben (Inputs)'!E291,\"\")","v":""}]
[null,null,{"$f":"IF('Eingaben (Inputs)'!C292<>\"\",'Eingaben (Inputs)'!C292,\"\")","v":"Kosten (Angabe pro Fahrzeug)"},null,{"$f":"IF('Eingaben (Inputs)'!E292<>\"\",'Eingaben (Inputs)'!E292,\"\")","v":""}]
[null,null,{"$f":"IF('Eingaben (Inputs)'!C293<>\"\",'Eingaben (Inputs)'!C293,\"\")","v":"Laufzeit"},{"$f":"'Eingaben (Inputs)'!D293","v":48},{"$f":"IF('Eingaben (Inputs)'!E293<>\"\",'Eingaben (Inputs)'!E293,\"\")","v":"Monate"}]
[null,null,{"$f":"IF('Eingaben (Inputs)'!C294<>\"\",'Eingaben (Inputs)'!C294,\"\")","v":"Leasing-Zinssatz"},{"v":0.03,"d":"3.0%"},{"$f":"IF('Eingaben (Inputs)'!E294<>\"\",'Eingaben (Inputs)'!E294,\"\")","v":""},{"$f":"\"Standardwert: \"&TEXT('1a. Defaults Segment-Ebene'!D294,\"##0.0%\")","v":"Standardwert: 3.0%"}]
[null,null,{"$f":"IF('Eingaben (Inputs)'!C295<>\"\",'Eingaben (Inputs)'!C295,\"\")","v":"Anschaffungspreis inkl. Flottenrabatt Verbrenner"},{"$f":"INDEX('2d. Annahmen'!$H$13:$H$16,_xlfn.XMATCH(D276,'2d. Annahmen'!$B$4:$B$7))*(1-'2d. Annahmen'!$B$30)","v":{"v":27219.464999999997,"d":"27,219"}},{"$f":"IF('Eingaben (Inputs)'!E295<>\"\",'Eingaben (Inputs)'!E295,\"\")","v":"CHF"},{"$f":"\"Standardwert: \"&TEXT('1a. Defaults Segment-Ebene'!D295,\"#’##0\")&\" \"&E295","v":"Standardwert: 27’219 CHF"}]
[null,null,{"$f":"IF('Eingaben (Inputs)'!C296<>\"\",'Eingaben (Inputs)'!C296,\"\")","v":"Service- und Reparaturkosten Verbrenner"},{"$f":"INDEX('2d. Annahmen'!$J$13:$J$16,_xlfn.XMATCH(D276,Grösse))/20000","v":0.05},{"$f":"IF('Eingaben (Inputs)'!E296<>\"\",'Eingaben (Inputs)'!E296,\"\")","v":"CHF/km"},{"$f":"\"Standardwert: \"&TEXT('1a. Defaults Segment-Ebene'!D296,\"##0.000\")&\" \"&E296","v":"Standardwert: 0.050 CHF/km"}]
[null,null,{"$f":"IF('Eingaben (Inputs)'!C297<>\"\",'Eingaben (Inputs)'!C297,\"\")","v":"Restwert Verbrenner"},{"$f":"_xlfn.LET(_xlpm.class,D276,_xlpm.km,ROUNDUP(D283*IF(D270=INDEX(Einsatzart,1),D284,D284+D285)*D293/12/5000,0)*5000,_xlpm.lz,D293,_xlpm.totkm,'2d. Annahmen'!$B$76:$G$76,_xlpm.totlz,'2d. Annahmen'!$A$77:$A$82,_xlpm.rkm,MIN(MAX(_xlpm.km,MIN(_xlpm.totkm)),MAX(_xlpm.totkm)),_xlpm.r,_xlfn.XMATCH(_xlpm.lz,_xlpm.totlz),_xlpm.c,_xlfn.XMATCH(_xlpm.rkm,_xlpm.totkm),_xlpm.delta,1+INDEX('2d. Annahmen'!$K$13:$K$16,_xlfn.XMATCH(_xlpm.class,Grösse)),_xlpm.delta*INDEX('2d. Annahmen'!$B$77:$G$82,_xlpm.r,_xlpm.c))","v":{"v":0.31606388888888887,"d":"32%"}},{"$f":"IF('Eingaben (Inputs)'!E297<>\"\",'Eingaben (Inputs)'!E297,\"\")","v":""},{"$f":"\"Standardwert: \"&TEXT('1a. Defaults Segment-Ebene'!D297,\"##0.0%\")","v":"Standardwert: 31.6%"}]
[null,null,{"$f":"IF('Eingaben (Inputs)'!C298<>\"\",'Eingaben (Inputs)'!C298,\"\")","v":"Anschaffungspreis inkl. Flottenrabatt E-Fahrzeug"},{"$f":"INDEX('2d. Annahmen'!$K$4:$K$7,_xlfn.XMATCH(D276,'2d. Annahmen'!$B$4:$B$7))*(1-'2d. Annahmen'!$B$29)","v":{"v":28810.890000000003,"d":"28,811"}},{"$f":"IF('Eingaben (Inputs)'!E298<>\"\",'Eingaben (Inputs)'!E298,\"\")","v":"CHF"},{"$f":"\"Standardwert: \"&TEXT('1a. Defaults Segment-Ebene'!D298,\"#’##0\")&\" \"&E298","v":"Standardwert: 28’811 CHF"}]
[null,null,{"$f":"IF('Eingaben (Inputs)'!C299<>\"\",'Eingaben (Inputs)'!C299,\"\")","v":"Service- und Reparaturkosten E-Fahrzeug"},{"$f":"D296*0.5","v":0.025},{"$f":"IF('Eingaben (Inputs)'!E299<>\"\",'Eingaben (Inputs)'!E299,\"\")","v":"CHF/km"},{"$f":"\"Standardwert: \"&TEXT('1a. Defaults Segment-Ebene'!D299,\"0.000\")&\" \"&E299","v":"Standardwert: 0.025 CHF/km"}]
[null,null,{"$f":"IF('Eingaben (Inputs)'!C300<>\"\",'Eingaben (Inputs)'!C300,\"\")","v":"Restwert E-Fahrzeug"},{"$f":"_xlfn.LET(_xlpm.class,D276,_xlpm.km,ROUNDUP(D283*IF(D270=INDEX(Einsatzart,1),D284,D284+D285)*D293/12/5000,0)*5000,_xlpm.lz,D293,_xlpm.totkm,'2d. Annahmen'!$B$76:$G$76,_xlpm.totlz,'2d. Annahmen'!$A$77:$A$82,_xlpm.rkm,MIN(MAX(_xlpm.km,MIN(_xlpm.totkm)),MAX(_xlpm.totkm)),_xlpm.r,_xlfn.XMATCH(_xlpm.lz,_xlpm.totlz),_xlpm.c,_xlfn.XMATCH(_xlpm.rkm,_xlpm.totkm),_xlpm.delta,1+INDEX('2d. Annahmen'!$N$4:$N$7,_xlfn.XMATCH(_xlpm.class,Grösse)),_xlpm.delta*INDEX('2d. Annahmen'!$B$77:$G$82,_xlpm.r,_xlpm.c))","v":{"v":0.30658197222222217,"d":"31%"}},{"$f":"IF('Eingaben (Inputs)'!E300<>\"\",'Eingaben (Inputs)'!E300,\"\")","v":""},{"$f":"\"Standardwert: \"&TEXT('1a. Defaults Segment-Ebene'!D300,\"##0.0%\")","v":"Standardwert: 30.7%"}]
[null,null,{"$f":"IF('Eingaben (Inputs)'!C301<>\"\",'Eingaben (Inputs)'!C301,\"\")","v":""},null,{"$f":"IF('Eingaben (Inputs)'!E301<>\"\",'Eingaben (Inputs)'!E301,\"\")","v":""}]
[null,null,{"$f":"IF('Eingaben (Inputs)'!C302<>\"\",'Eingaben (Inputs)'!C302,\"\")","v":""},null,{"$f":"IF('Eingaben (Inputs)'!E302<>\"\",'Eingaben (Inputs)'!E302,\"\")","v":""}]
[null,"2.9)",{"$f":"IF('Eingaben (Inputs)'!C303<>\"\",'Eingaben (Inputs)'!C303,\"\")","v":"Segment I"},null,{"$f":"IF('Eingaben (Inputs)'!E303<>\"\",'Eingaben (Inputs)'!E303,\"\")","v":""}]
[null,null,{"$f":"IF('Eingaben (Inputs)'!C304<>\"\",'Eingaben (Inputs)'!C304,\"\")","v":""},null,{"$f":"IF('Eingaben (Inputs)'!E304<>\"\",'Eingaben (Inputs)'!E304,\"\")","v":""}]
[null,null,{"$f":"IF('Eingaben (Inputs)'!C305<>\"\",'Eingaben (Inputs)'!C305,\"\")","v":"Segmentstruktur"},null,{"$f":"IF('Eingaben (Inputs)'!E305<>\"\",'Eingaben (Inputs)'!E305,\"\")","v":""}]
[null,null,{"$f":"IF('Eingaben (Inputs)'!C306<>\"\",'Eingaben (Inputs)'!C306,\"\")","v":"Anzahl Fahrzeuge"},{"$f":"'Eingaben (Inputs)'!D306","v":1},{"$f":"IF('Eingaben (Inputs)'!E306<>\"\",'Eingaben (Inputs)'!E306,\"\")","v":""}]
[null,null,{"$f":"IF('Eingaben (Inputs)'!C307<>\"\",'Eingaben (Inputs)'!C307,\"\")","v":"Einsatzart"},{"$f":"'Eingaben (Inputs)'!D307","v":"Poolfahrzeuge"},{"$f":"IF('Eingaben (Inputs)'!E307<>\"\",'Eingaben (Inputs)'!E307,\"\")","v":""}]
[null,null,{"$f":"IF('Eingaben (Inputs)'!C308<>\"\",'Eingaben (Inputs)'!C308,\"\")","v":"Einsatzgebiet"},{"$f":"'Eingaben (Inputs)'!D308","v":"regional"},{"$f":"IF('Eingaben (Inputs)'!E308<>\"\",'Eingaben (Inputs)'!E308,\"\")","v":""}]
[null,null,{"$f":"IF('Eingaben (Inputs)'!C309<>\"\",'Eingaben (Inputs)'!C309,\"\")","v":"Heimlademöglichkeit"},{"$f":"INDEX(Heimladen,NOT(_xlfn.XMATCH(D307,Einsatzart)-1)+1)","v":"Nein"},{"$f":"IF('Eingaben (Inputs)'!E309<>\"\",'Eingaben (Inputs)'!E309,\"\")","v":""},{"$f":"\"Standardwert: \"&'1a. Defaults Segment-Ebene'!D309","v":"Standardwert: Nein"}]
[null,null,{"$f":"IF('Eingaben (Inputs)'!C310<>\"\",'Eingaben (Inputs)'!C310,\"\")","v":""},null,{"$f":"IF('Eingaben (Inputs)'!E310<>\"\",'Eingaben (Inputs)'!E310,\"\")","v":""}]
[null,null,{"$f":"IF('Eingaben (Inputs)'!C311<>\"\",'Eingaben (Inputs)'!C311,\"\")","v":"Fahrzeugdaten"},null,{"$f":"IF('Eingaben (Inputs)'!E311<>\"\",'Eingaben (Inputs)'!E311,\"\")","v":""}]
[null,null,{"$f":"IF('Eingaben (Inputs)'!C312<>\"\",'Eingaben (Inputs)'!C312,\"\")","v":"Fahrzeuggrösse"},{"$f":"'Eingaben (Inputs)'!D312","v":"Mittelklasse"},{"$f":"IF('Eingaben (Inputs)'!E312<>\"\",'Eingaben (Inputs)'!E312,\"\")","v":""}]
[null,null,{"$f":"IF('Eingaben (Inputs)'!C313<>\"\",'Eingaben (Inputs)'!C313,\"\")","v":"Treibstoffverbrauch Verbrenner"},{"$f":"INDEX('2d. Annahmen'!$F$13:$F$16,_xlfn.XMATCH(D312,Grösse))","v":5.8},{"$f":"IF('Eingaben (Inputs)'!E313<>\"\",'Eingaben (Inputs)'!E313,\"\")","v":"l/100 km"},{"$f":"\"Standardwert: \"&TEXT('1a. Defaults Segment-Ebene'!D313,\"##0.0\")&\" \"&E313","v":"Standardwert: 5.8 l/100 km"}]
[null,null,{"$f":"IF('Eingaben (Inputs)'!C314<>\"\",'Eingaben (Inputs)'!C314,\"\")","v":"Energieverbrauch E-Fahrzeug"},{"$f":"INDEX('2d. Annahmen'!$H$4:$H$7,_xlfn.XMATCH(D312,Grösse))","v":15.1},{"$f":"IF('Eingaben (Inputs)'!E314<>\"\",'Eingaben (Inputs)'!E314,\"\")","v":"kWh/100 km"},{"$f":"\"Standardwert: \"&TEXT('1a. Defaults Segment-Ebene'!D314,\"##0.0\")&\" \"&E314","v":"Standardwert: 15.1 kWh/100 km"}]
[null,null,{"$f":"IF('Eingaben (Inputs)'!C315<>\"\",'Eingaben (Inputs)'!C315,\"\")","v":"Batteriekapazität (netto)"},{"$f":"INDEX('2d. Annahmen'!$F$4:$F$7,_xlfn.XMATCH(D312,Grösse))","v":58.625},{"$f":"IF('Eingaben (Inputs)'!E315<>\"\",'Eingaben (Inputs)'!E315,\"\")","v":"kWh"},{"$f":"\"Standardwert: \"&TEXT('1a. Defaults Segment-Ebene'!D315,\"##0.0\")&\" \"&E315","v":"Standardwert: 58.6 kWh"}]
[null,null,{"$f":"IF('Eingaben (Inputs)'!C316<>\"\",'Eingaben (Inputs)'!C316,\"\")","v":""},null,{"$f":"IF('Eingaben (Inputs)'!E316<>\"\",'Eingaben (Inputs)'!E316,\"\")","v":""}]
[null,null,{"$f":"IF('Eingaben (Inputs)'!C317<>\"\",'Eingaben (Inputs)'!C317,\"\")","v":"Fahr- und Nutzungsprofil (Angabe pro Fahrzeug)"},null,{"$f":"IF('Eingaben (Inputs)'!E317<>\"\",'Eingaben (Inputs)'!E317,\"\")","v":""}]
[null,null,{"$f":"IF('Eingaben (Inputs)'!C318<>\"\",'Eingaben (Inputs)'!C318,\"\")","v":"Nutzungsmuster"},{"$f":"'Eingaben (Inputs)'!D318","v":"Werktagsbetrieb"},{"$f":"IF('Eingaben (Inputs)'!E318<>\"\",'Eingaben (Inputs)'!E318,\"\")","v":""}]
[null,null,{"$f":"IF('Eingaben (Inputs)'!C319<>\"\",'Eingaben (Inputs)'!C319,\"\")","v":"Anzahl Arbeitstage pro Jahr"},{"$f":"INDEX('1e. Dropdown Values'!$A$7:$D$7,_xlfn.XMATCH(D318,'1e. Dropdown Values'!$A$6:$D$6))","v":260},{"$f":"IF('Eingaben (Inputs)'!E319<>\"\",'Eingaben (Inputs)'!E319,\"\")","v":""},{"$f":"\"Standardwert: \"&TEXT('1a. Defaults Segment-Ebene'!D319,\"##0\")","v":"Standardwert: 260"}]
[null,null,{"$f":"IF('Eingaben (Inputs)'!C320<>\"\",'Eingaben (Inputs)'!C320,\"\")","v":"Fahrdistanz während der Arbeitszeit"},{"$f":"INDEX('1e. Dropdown Values'!$A$4:$D$4,_xlfn.XMATCH(D308,'1e. Dropdown Values'!$A$3:$D$3))","v":100},{"$f":"IF('Eingaben (Inputs)'!E320<>\"\",'Eingaben (Inputs)'!E320,\"\")","v":"km/Tag"},{"$f":"\"Standardwert: \"&TEXT('1a. Defaults Segment-Ebene'!D320,\"##0\")&\" \"&E320","v":"Standardwert: 100 km/Tag"}]
[null,null,{"$f":"IF('Eingaben (Inputs)'!C321<>\"\",'Eingaben (Inputs)'!C321,\"\")","v":"Pendeldistanz (Hin- und Rückfahrt)"},{"$f":"(_xlfn.XMATCH(D307,Einsatzart)-1)*30","v":0},{"$f":"IF('Eingaben (Inputs)'!E321<>\"\",'Eingaben (Inputs)'!E321,\"\")","v":"km/Tag"},{"$f":"\"Standardwert: \"&TEXT('1a. Defaults Segment-Ebene'!D321,\"##0\")&\" \"&E321","v":"Standardwert: 0 km/Tag"}]
[null,null,{"$f":"IF('Eingaben (Inputs)'!C322<>\"\",'Eingaben (Inputs)'!C322,\"\")","v":"Anzahl Einsätze pro Tag"},1,{"$f":"IF('Eingaben (Inputs)'!E322<>\"\",'Eingaben (Inputs)'!E322,\"\")","v":""},{"$f":"\"Standardwert: \"&TEXT('1a. Defaults Segment-Ebene'!D322,\"##0\")","v":"Standardwert: 1"}]
[null,null,{"$f":"IF('Eingaben (Inputs)'!C323<>\"\",'Eingaben (Inputs)'!C323,\"\")","v":"Anzahl Pausen pro Tag"},null,{"$f":"IF('Eingaben (Inputs)'!E323<>\"\",'Eingaben (Inputs)'!E323,\"\")","v":""}]
[null,null,{"$f":"IF('Eingaben (Inputs)'!C324<>\"\",'Eingaben (Inputs)'!C324,\"\")","v":"Standzeit pro Pause am Firmenstandort"},{"$f":"INDEX('1e. Dropdown Values'!$A$9:$D$9,_xlfn.XMATCH(D318,'1e. Dropdown Values'!$A$6:$D$6))","v":1},{"$f":"IF('Eingaben (Inputs)'!E324<>\"\",'Eingaben (Inputs)'!E324,\"\")","v":"Stunden"},{"$f":"\"Standardwert: \"&TEXT('1a. Defaults Segment-Ebene'!D324,\"##0\")&\" \"&IF(D324=1,\"Stunde\",E324)","v":"Standardwert: 1 Stunde"}]
[null,null,{"$f":"IF('Eingaben (Inputs)'!C325<>\"\",'Eingaben (Inputs)'!C325,\"\")","v":"Standzeit über Nacht"},{"$f":"INDEX('1e. Dropdown Values'!$A$8:$D$8,_xlfn.XMATCH(D318,'1e. Dropdown Values'!$A$6:$D$6))","v":8},{"$f":"IF('Eingaben (Inputs)'!E325<>\"\",'Eingaben (Inputs)'!E325,\"\")","v":"Stunden"},{"$f":"\"Standardwert: \"&TEXT('1a. Defaults Segment-Ebene'!D325,\"##0\")&\" \"&IF(D325=1,\"Stunde\",E325)","v":"Standardwert: 8 Stunden"}]
[null,null,{"$f":"IF('Eingaben (Inputs)'!C326<>\"\",'Eingaben (Inputs)'!C326,\"\")","v":"Fahrzeuge pro Ladepunkt, Firmenstandort (tagsüber)"},{"$f":"INDEX('1e. Dropdown Values'!$B$10:$D$10,_xlfn.XMATCH(D318,Nutzungsmuster))","v":1},{"$f":"IF('Eingaben (Inputs)'!E326<>\"\",'Eingaben (Inputs)'!E326,\"\")","v":""},{"$f":"\"Standardwert: \"&TEXT('1a. Defaults Segment-Ebene'!D326,\"##0\")","v":"Standardwert: 1"}]
[null,null,{"$f":"IF('Eingaben (Inputs)'!C327<>\"\",'Eingaben (Inputs)'!C327,\"\")","v":""},null,{"$f":"IF('Eingaben (Inputs)'!E327<>\"\",'Eingaben (Inputs)'!E327,\"\")","v":""}]
[null,null,{"$f":"IF('Eingaben (Inputs)'!C328<>\"\",'Eingaben (Inputs)'!C328,\"\")","v":"Kosten (Angabe pro Fahrzeug)"},null,{"$f":"IF('Eingaben (Inputs)'!E328<>\"\",'Eingaben (Inputs)'!E328,\"\")","v":""}]
[null,null,{"$f":"IF('Eingaben (Inputs)'!C329<>\"\",'Eingaben (Inputs)'!C329,\"\")","v":"Laufzeit"},{"$f":"'Eingaben (Inputs)'!D329","v":48},{"$f":"IF('Eingaben (Inputs)'!E329<>\"\",'Eingaben (Inputs)'!E329,\"\")","v":"Monate"}]
[null,null,{"$f":"IF('Eingaben (Inputs)'!C330<>\"\",'Eingaben (Inputs)'!C330,\"\")","v":"Leasing-Zinssatz"},{"v":0.03,"d":"3.0%"},{"$f":"IF('Eingaben (Inputs)'!E330<>\"\",'Eingaben (Inputs)'!E330,\"\")","v":""},{"$f":"\"Standardwert: \"&TEXT('1a. Defaults Segment-Ebene'!D330,\"##0.0%\")","v":"Standardwert: 3.0%"}]
[null,null,{"$f":"IF('Eingaben (Inputs)'!C331<>\"\",'Eingaben (Inputs)'!C331,\"\")","v":"Anschaffungspreis inkl. Flottenrabatt Verbrenner"},{"$f":"INDEX('2d. Annahmen'!$H$13:$H$16,_xlfn.XMATCH(D312,'2d. Annahmen'!$B$4:$B$7))*(1-'2d. Annahmen'!$B$30)","v":{"v":27219.464999999997,"d":"27,219"}},{"$f":"IF('Eingaben (Inputs)'!E331<>\"\",'Eingaben (Inputs)'!E331,\"\")","v":"CHF"},{"$f":"\"Standardwert: \"&TEXT('1a. Defaults Segment-Ebene'!D331,\"#’##0\")&\" \"&E331","v":"Standardwert: 27’219 CHF"}]
[null,null,{"$f":"IF('Eingaben (Inputs)'!C332<>\"\",'Eingaben (Inputs)'!C332,\"\")","v":"Service- und Reparaturkosten Verbrenner"},{"$f":"INDEX('2d. Annahmen'!$J$13:$J$16,_xlfn.XMATCH(D312,Grösse))/20000","v":0.05},{"$f":"IF('Eingaben (Inputs)'!E332<>\"\",'Eingaben (Inputs)'!E332,\"\")","v":"CHF/km"},{"$f":"\"Standardwert: \"&TEXT('1a. Defaults Segment-Ebene'!D332,\"##0.000\")&\" \"&E332","v":"Standardwert: 0.050 CHF/km"}]
[null,null,{"$f":"IF('Eingaben (Inputs)'!C333<>\"\",'Eingaben (Inputs)'!C333,\"\")","v":"Restwert Verbrenner"},{"$f":"_xlfn.LET(_xlpm.class,D312,_xlpm.km,ROUNDUP(D319*IF(D306=INDEX(Einsatzart,1),D320,D320+D321)*D329/12/5000,0)*5000,_xlpm.lz,D329,_xlpm.totkm,'2d. Annahmen'!$B$76:$G$76,_xlpm.totlz,'2d. Annahmen'!$A$77:$A$82,_xlpm.rkm,MIN(MAX(_xlpm.km,MIN(_xlpm.totkm)),MAX(_xlpm.totkm)),_xlpm.r,_xlfn.XMATCH(_xlpm.lz,_xlpm.totlz),_xlpm.c,_xlfn.XMATCH(_xlpm.rkm,_xlpm.totkm),_xlpm.delta,1+INDEX('2d. Annahmen'!$K$13:$K$16,_xlfn.XMATCH(_xlpm.class,Grösse)),_xlpm.delta*INDEX('2d. Annahmen'!$B$77:$G$82,_xlpm.r,_xlpm.c))","v":{"v":0.31606388888888887,"d":"32%"}},{"$f":"IF('Eingaben (Inputs)'!E333<>\"\",'Eingaben (Inputs)'!E333,\"\")","v":""},{"$f":"\"Standardwert: \"&TEXT('1a. Defaults Segment-Ebene'!D333,\"##0.0%\")","v":"Standardwert: 31.6%"}]
[null,null,{"$f":"IF('Eingaben (Inputs)'!C334<>\"\",'Eingaben (Inputs)'!C334,\"\")","v":"Anschaffungspreis inkl. Flottenrabatt E-Fahrzeug"},{"$f":"INDEX('2d. Annahmen'!$K$4:$K$7,_xlfn.XMATCH(D312,'2d. Annahmen'!$B$4:$B$7))*(1-'2d. Annahmen'!$B$29)","v":{"v":28810.890000000003,"d":"28,811"}},{"$f":"IF('Eingaben (Inputs)'!E334<>\"\",'Eingaben (Inputs)'!E334,\"\")","v":"CHF"},{"$f":"\"Standardwert: \"&TEXT('1a. Defaults Segment-Ebene'!D334,\"#’##0\")&\" \"&E334","v":"Standardwert: 28’811 CHF"}]
[null,null,{"$f":"IF('Eingaben (Inputs)'!C335<>\"\",'Eingaben (Inputs)'!C335,\"\")","v":"Service- und Reparaturkosten E-Fahrzeug"},{"$f":"D332*0.5","v":0.025},{"$f":"IF('Eingaben (Inputs)'!E335<>\"\",'Eingaben (Inputs)'!E335,\"\")","v":"CHF/km"},{"$f":"\"Standardwert: \"&TEXT('1a. Defaults Segment-Ebene'!D335,\"0.000\")&\" \"&E335","v":"Standardwert: 0.025 CHF/km"}]
[null,null,{"$f":"IF('Eingaben (Inputs)'!C336<>\"\",'Eingaben (Inputs)'!C336,\"\")","v":"Restwert E-Fahrzeug"},{"$f":"_xlfn.LET(_xlpm.class,D312,_xlpm.km,ROUNDUP(D319*IF(D306=INDEX(Einsatzart,1),D320,D320+D321)*D329/12/5000,0)*5000,_xlpm.lz,D329,_xlpm.totkm,'2d. Annahmen'!$B$76:$G$76,_xlpm.totlz,'2d. Annahmen'!$A$77:$A$82,_xlpm.rkm,MIN(MAX(_xlpm.km,MIN(_xlpm.totkm)),MAX(_xlpm.totkm)),_xlpm.r,_xlfn.XMATCH(_xlpm.lz,_xlpm.totlz),_xlpm.c,_xlfn.XMATCH(_xlpm.rkm,_xlpm.totkm),_xlpm.delta,1+INDEX('2d. Annahmen'!$N$4:$N$7,_xlfn.XMATCH(_xlpm.class,Grösse)),_xlpm.delta*INDEX('2d. Annahmen'!$B$77:$G$82,_xlpm.r,_xlpm.c))","v":{"v":0.30658197222222217,"d":"31%"}},{"$f":"IF('Eingaben (Inputs)'!E336<>\"\",'Eingaben (Inputs)'!E336,\"\")","v":""},{"$f":"\"Standardwert: \"&TEXT('1a. Defaults Segment-Ebene'!D336,\"##0.0%\")","v":"Standardwert: 30.7%"}]
[null,null,{"$f":"IF('Eingaben (Inputs)'!C337<>\"\",'Eingaben (Inputs)'!C337,\"\")","v":""},null,{"$f":"IF('Eingaben (Inputs)'!E337<>\"\",'Eingaben (Inputs)'!E337,\"\")","v":""}]
[null,null,{"$f":"IF('Eingaben (Inputs)'!C338<>\"\",'Eingaben (Inputs)'!C338,\"\")","v":""},null,{"$f":"IF('Eingaben (Inputs)'!E338<>\"\",'Eingaben (Inputs)'!E338,\"\")","v":""}]
[null,"2.10)",{"$f":"IF('Eingaben (Inputs)'!C339<>\"\",'Eingaben (Inputs)'!C339,\"\")","v":"Segment J"},null,{"$f":"IF('Eingaben (Inputs)'!E339<>\"\",'Eingaben (Inputs)'!E339,\"\")","v":""}]
[null,null,{"$f":"IF('Eingaben (Inputs)'!C340<>\"\",'Eingaben (Inputs)'!C340,\"\")","v":""},null,{"$f":"IF('Eingaben (Inputs)'!E340<>\"\",'Eingaben (Inputs)'!E340,\"\")","v":""}]
[null,null,{"$f":"IF('Eingaben (Inputs)'!C341<>\"\",'Eingaben (Inputs)'!C341,\"\")","v":"Segmentstruktur"},null,{"$f":"IF('Eingaben (Inputs)'!E341<>\"\",'Eingaben (Inputs)'!E341,\"\")","v":""}]
[null,null,{"$f":"IF('Eingaben (Inputs)'!C342<>\"\",'Eingaben (Inputs)'!C342,\"\")","v":"Anzahl Fahrzeuge"},{"$f":"'Eingaben (Inputs)'!D342","v":1},{"$f":"IF('Eingaben (Inputs)'!E342<>\"\",'Eingaben (Inputs)'!E342,\"\")","v":""}]
[null,null,{"$f":"IF('Eingaben (Inputs)'!C343<>\"\",'Eingaben (Inputs)'!C343,\"\")","v":"Einsatzart"},{"$f":"'Eingaben (Inputs)'!D343","v":"Poolfahrzeuge"},{"$f":"IF('Eingaben (Inputs)'!E343<>\"\",'Eingaben (Inputs)'!E343,\"\")","v":""}]
[null,null,{"$f":"IF('Eingaben (Inputs)'!C344<>\"\",'Eingaben (Inputs)'!C344,\"\")","v":"Einsatzgebiet"},{"$f":"'Eingaben (Inputs)'!D344","v":"regional"},{"$f":"IF('Eingaben (Inputs)'!E344<>\"\",'Eingaben (Inputs)'!E344,\"\")","v":""}]
[null,null,{"$f":"IF('Eingaben (Inputs)'!C345<>\"\",'Eingaben (Inputs)'!C345,\"\")","v":"Heimlademöglichkeit"},{"$f":"INDEX(Heimladen,NOT(_xlfn.XMATCH(D343,Einsatzart)-1)+1)","v":"Nein"},{"$f":"IF('Eingaben (Inputs)'!E345<>\"\",'Eingaben (Inputs)'!E345,\"\")","v":""},{"$f":"\"Standardwert: \"&'1a. Defaults Segment-Ebene'!D345","v":"Standardwert: Nein"}]
[null,null,{"$f":"IF('Eingaben (Inputs)'!C346<>\"\",'Eingaben (Inputs)'!C346,\"\")","v":""},null,{"$f":"IF('Eingaben (Inputs)'!E346<>\"\",'Eingaben (Inputs)'!E346,\"\")","v":""}]
[null,null,{"$f":"IF('Eingaben (Inputs)'!C347<>\"\",'Eingaben (Inputs)'!C347,\"\")","v":"Fahrzeugdaten"},null,{"$f":"IF('Eingaben (Inputs)'!E347<>\"\",'Eingaben (Inputs)'!E347,\"\")","v":""}]
[null,null,{"$f":"IF('Eingaben (Inputs)'!C348<>\"\",'Eingaben (Inputs)'!C348,\"\")","v":"Fahrzeuggrösse"},{"$f":"'Eingaben (Inputs)'!D348","v":"Mittelklasse"},{"$f":"IF('Eingaben (Inputs)'!E348<>\"\",'Eingaben (Inputs)'!E348,\"\")","v":""}]
[null,null,{"$f":"IF('Eingaben (Inputs)'!C349<>\"\",'Eingaben (Inputs)'!C349,\"\")","v":"Treibstoffverbrauch Verbrenner"},{"$f":"INDEX('2d. Annahmen'!$F$13:$F$16,_xlfn.XMATCH(D348,Grösse))","v":5.8},{"$f":"IF('Eingaben (Inputs)'!E349<>\"\",'Eingaben (Inputs)'!E349,\"\")","v":"l/100 km"},{"$f":"\"Standardwert: \"&TEXT('1a. Defaults Segment-Ebene'!D349,\"##0.0\")&\" \"&E349","v":"Standardwert: 5.8 l/100 km"}]
[null,null,{"$f":"IF('Eingaben (Inputs)'!C350<>\"\",'Eingaben (Inputs)'!C350,\"\")","v":"Energieverbrauch E-Fahrzeug"},{"$f":"INDEX('2d. Annahmen'!$H$4:$H$7,_xlfn.XMATCH(D348,Grösse))","v":15.1},{"$f":"IF('Eingaben (Inputs)'!E350<>\"\",'Eingaben (Inputs)'!E350,\"\")","v":"kWh/100 km"},{"$f":"\"Standardwert: \"&TEXT('1a. Defaults Segment-Ebene'!D350,\"##0.0\")&\" \"&E350","v":"Standardwert: 15.1 kWh/100 km"}]
[null,null,{"$f":"IF('Eingaben (Inputs)'!C351<>\"\",'Eingaben (Inputs)'!C351,\"\")","v":"Batteriekapazität (netto)"},{"$f":"INDEX('2d. Annahmen'!$F$4:$F$7,_xlfn.XMATCH(D348,Grösse))","v":58.625},{"$f":"IF('Eingaben (Inputs)'!E351<>\"\",'Eingaben (Inputs)'!E351,\"\")","v":"kWh"},{"$f":"\"Standardwert: \"&TEXT('1a. Defaults Segment-Ebene'!D351,\"##0.0\")&\" \"&E351","v":"Standardwert: 58.6 kWh"}]
[null,null,{"$f":"IF('Eingaben (Inputs)'!C352<>\"\",'Eingaben (Inputs)'!C352,\"\")","v":""},null,{"$f":"IF('Eingaben (Inputs)'!E352<>\"\",'Eingaben (Inputs)'!E352,\"\")","v":""}]
[null,null,{"$f":"IF('Eingaben (Inputs)'!C353<>\"\",'Eingaben (Inputs)'!C353,\"\")","v":"Fahr- und Nutzungsprofil (Angabe pro Fahrzeug)"},null,{"$f":"IF('Eingaben (Inputs)'!E353<>\"\",'Eingaben (Inputs)'!E353,\"\")","v":""}]
[null,null,{"$f":"IF('Eingaben (Inputs)'!C354<>\"\",'Eingaben (Inputs)'!C354,\"\")","v":"Nutzungsmuster"},{"$f":"'Eingaben (Inputs)'!D354","v":"Werktagsbetrieb"},{"$f":"IF('Eingaben (Inputs)'!E354<>\"\",'Eingaben (Inputs)'!E354,\"\")","v":""}]
[null,null,{"$f":"IF('Eingaben (Inputs)'!C355<>\"\",'Eingaben (Inputs)'!C355,\"\")","v":"Anzahl Arbeitstage pro Jahr"},{"$f":"INDEX('1e. Dropdown Values'!$A$7:$D$7,_xlfn.XMATCH(D354,'1e. Dropdown Values'!$A$6:$D$6))","v":260},{"$f":"IF('Eingaben (Inputs)'!E355<>\"\",'Eingaben (Inputs)'!E355,\"\")","v":""},{"$f":"\"Standardwert: \"&TEXT('1a. Defaults Segment-Ebene'!D355,\"##0\")","v":"Standardwert: 260"}]
[null,null,{"$f":"IF('Eingaben (Inputs)'!C356<>\"\",'Eingaben (Inputs)'!C356,\"\")","v":"Fahrdistanz während der Arbeitszeit"},{"$f":"INDEX('1e. Dropdown Values'!$A$4:$D$4,_xlfn.XMATCH(D344,'1e. Dropdown Values'!$A$3:$D$3))","v":100},{"$f":"IF('Eingaben (Inputs)'!E356<>\"\",'Eingaben (Inputs)'!E356,\"\")","v":"km/Tag"},{"$f":"\"Standardwert: \"&TEXT('1a. Defaults Segment-Ebene'!D356,\"##0\")&\" \"&E356","v":"Standardwert: 100 km/Tag"}]
[null,null,{"$f":"IF('Eingaben (Inputs)'!C357<>\"\",'Eingaben (Inputs)'!C357,\"\")","v":"Pendeldistanz (Hin- und Rückfahrt)"},{"$f":"(_xlfn.XMATCH(D343,Einsatzart)-1)*30","v":0},{"$f":"IF('Eingaben (Inputs)'!E357<>\"\",'Eingaben (Inputs)'!E357,\"\")","v":"km/Tag"},{"$f":"\"Standardwert: \"&TEXT('1a. Defaults Segment-Ebene'!D357,\"##0\")&\" \"&E357","v":"Standardwert: 0 km/Tag"}]
[null,null,{"$f":"IF('Eingaben (Inputs)'!C358<>\"\",'Eingaben (Inputs)'!C358,\"\")","v":"Anzahl Einsätze pro Tag"},1,{"$f":"IF('Eingaben (Inputs)'!E358<>\"\",'Eingaben (Inputs)'!E358,\"\")","v":""},{"$f":"\"Standardwert: \"&TEXT('1a. Defaults Segment-Ebene'!D358,\"##0\")","v":"Standardwert: 1"}]
[null,null,{"$f":"IF('Eingaben (Inputs)'!C359<>\"\",'Eingaben (Inputs)'!C359,\"\")","v":"Anzahl Pausen pro Tag"},null,{"$f":"IF('Eingaben (Inputs)'!E359<>\"\",'Eingaben (Inputs)'!E359,\"\")","v":""}]
[null,null,{"$f":"IF('Eingaben (Inputs)'!C360<>\"\",'Eingaben (Inputs)'!C360,\"\")","v":"Standzeit pro Pause am Firmenstandort"},{"$f":"INDEX('1e. Dropdown Values'!$A$9:$D$9,_xlfn.XMATCH(D354,'1e. Dropdown Values'!$A$6:$D$6))","v":1},{"$f":"IF('Eingaben (Inputs)'!E360<>\"\",'Eingaben (Inputs)'!E360,\"\")","v":"Stunden"},{"$f":"\"Standardwert: \"&TEXT('1a. Defaults Segment-Ebene'!D360,\"##0\")&\" \"&IF(D360=1,\"Stunde\",E360)","v":"Standardwert: 1 Stunde"}]
[null,null,{"$f":"IF('Eingaben (Inputs)'!C361<>\"\",'Eingaben (Inputs)'!C361,\"\")","v":"Standzeit über Nacht"},{"$f":"INDEX('1e. Dropdown Values'!$A$8:$D$8,_xlfn.XMATCH(D354,'1e. Dropdown Values'!$A$6:$D$6))","v":8},{"$f":"IF('Eingaben (Inputs)'!E361<>\"\",'Eingaben (Inputs)'!E361,\"\")","v":"Stunden"},{"$f":"\"Standardwert: \"&TEXT('1a. Defaults Segment-Ebene'!D361,\"##0\")&\" \"&IF(D361=1,\"Stunde\",E361)","v":"Standardwert: 8 Stunden"}]
[null,null,{"$f":"IF('Eingaben (Inputs)'!C362<>\"\",'Eingaben (Inputs)'!C362,\"\")","v":"Fahrzeuge pro Ladepunkt, Firmenstandort (tagsüber)"},{"$f":"INDEX('1e. Dropdown Values'!$B$10:$D$10,_xlfn.XMATCH(D354,Nutzungsmuster))","v":1},{"$f":"IF('Eingaben (Inputs)'!E362<>\"\",'Eingaben (Inputs)'!E362,\"\")","v":""},{"$f":"\"Standardwert: \"&TEXT('1a. Defaults Segment-Ebene'!D362,\"##0\")","v":"Standardwert: 1"}]
[null,null,{"$f":"IF('Eingaben (Inputs)'!C363<>\"\",'Eingaben (Inputs)'!C363,\"\")","v":""},null,{"$f":"IF('Eingaben (Inputs)'!E363<>\"\",'Eingaben (Inputs)'!E363,\"\")","v":""}]
[null,null,{"$f":"IF('Eingaben (Inputs)'!C364<>\"\",'Eingaben (Inputs)'!C364,\"\")","v":"Kosten (Angabe pro Fahrzeug)"},null,{"$f":"IF('Eingaben (Inputs)'!E364<>\"\",'Eingaben (Inputs)'!E364,\"\")","v":""}]
[null,null,{"$f":"IF('Eingaben (Inputs)'!C365<>\"\",'Eingaben (Inputs)'!C365,\"\")","v":"Laufzeit"},{"$f":"'Eingaben (Inputs)'!D365","v":48},{"$f":"IF('Eingaben (Inputs)'!E365<>\"\",'Eingaben (Inputs)'!E365,\"\")","v":"Monate"}]
[null,null,{"$f":"IF('Eingaben (Inputs)'!C366<>\"\",'Eingaben (Inputs)'!C366,\"\")","v":"Leasing-Zinssatz"},{"v":0.03,"d":"3.0%"},{"$f":"IF('Eingaben (Inputs)'!E366<>\"\",'Eingaben (Inputs)'!E366,\"\")","v":""},{"$f":"\"Standardwert: \"&TEXT('1a. Defaults Segment-Ebene'!D366,\"##0.0%\")","v":"Standardwert: 3.0%"}]
[null,null,{"$f":"IF('Eingaben (Inputs)'!C367<>\"\",'Eingaben (Inputs)'!C367,\"\")","v":"Anschaffungspreis inkl. Flottenrabatt Verbrenner"},{"$f":"INDEX('2d. Annahmen'!$H$13:$H$16,_xlfn.XMATCH(D348,'2d. Annahmen'!$B$4:$B$7))*(1-'2d. Annahmen'!$B$30)","v":{"v":27219.464999999997,"d":"27,219"}},{"$f":"IF('Eingaben (Inputs)'!E367<>\"\",'Eingaben (Inputs)'!E367,\"\")","v":"CHF"},{"$f":"\"Standardwert: \"&TEXT('1a. Defaults Segment-Ebene'!D367,\"#’##0\")&\" \"&E367","v":"Standardwert: 27’219 CHF"}]
[null,null,{"$f":"IF('Eingaben (Inputs)'!C368<>\"\",'Eingaben (Inputs)'!C368,\"\")","v":"Service- und Reparaturkosten Verbrenner"},{"$f":"INDEX('2d. Annahmen'!$J$13:$J$16,_xlfn.XMATCH(D348,Grösse))/20000","v":0.05},{"$f":"IF('Eingaben (Inputs)'!E368<>\"\",'Eingaben (Inputs)'!E368,\"\")","v":"CHF/km"},{"$f":"\"Standardwert: \"&TEXT('1a. Defaults Segment-Ebene'!D368,\"##0.000\")&\" \"&E368","v":"Standardwert: 0.050 CHF/km"}]
[null,null,{"$f":"IF('Eingaben (Inputs)'!C369<>\"\",'Eingaben (Inputs)'!C369,\"\")","v":"Restwert Verbrenner"},{"$f":"_xlfn.LET(_xlpm.class,D348,_xlpm.km,ROUNDUP(D355*IF(D342=INDEX(Einsatzart,1),D356,D356+D357)*D365/12/5000,0)*5000,_xlpm.lz,D365,_xlpm.totkm,'2d. Annahmen'!$B$76:$G$76,_xlpm.totlz,'2d. Annahmen'!$A$77:$A$82,_xlpm.rkm,MIN(MAX(_xlpm.km,MIN(_xlpm.totkm)),MAX(_xlpm.totkm)),_xlpm.r,_xlfn.XMATCH(_xlpm.lz,_xlpm.totlz),_xlpm.c,_xlfn.XMATCH(_xlpm.rkm,_xlpm.totkm),_xlpm.delta,1+INDEX('2d. Annahmen'!$K$13:$K$16,_xlfn.XMATCH(_xlpm.class,Grösse)),_xlpm.delta*INDEX('2d. Annahmen'!$B$77:$G$82,_xlpm.r,_xlpm.c))","v":{"v":0.31606388888888887,"d":"32%"}},{"$f":"IF('Eingaben (Inputs)'!E369<>\"\",'Eingaben (Inputs)'!E369,\"\")","v":""},{"$f":"\"Standardwert: \"&TEXT('1a. Defaults Segment-Ebene'!D369,\"##0.0%\")","v":"Standardwert: 31.6%"}]
[null,null,{"$f":"IF('Eingaben (Inputs)'!C370<>\"\",'Eingaben (Inputs)'!C370,\"\")","v":"Anschaffungspreis inkl. Flottenrabatt E-Fahrzeug"},{"$f":"INDEX('2d. Annahmen'!$K$4:$K$7,_xlfn.XMATCH(D348,'2d. Annahmen'!$B$4:$B$7))*(1-'2d. Annahmen'!$B$29)","v":{"v":28810.890000000003,"d":"28,811"}},{"$f":"IF('Eingaben (Inputs)'!E370<>\"\",'Eingaben (Inputs)'!E370,\"\")","v":"CHF"},{"$f":"\"Standardwert: \"&TEXT('1a. Defaults Segment-Ebene'!D370,\"#’##0\")&\" \"&E370","v":"Standardwert: 28’811 CHF"}]
[null,null,{"$f":"IF('Eingaben (Inputs)'!C371<>\"\",'Eingaben (Inputs)'!C371,\"\")","v":"Service- und Reparaturkosten E-Fahrzeug"},{"$f":"D368*0.5","v":0.025},{"$f":"IF('Eingaben (Inputs)'!E371<>\"\",'Eingaben (Inputs)'!E371,\"\")","v":"CHF/km"},{"$f":"\"Standardwert: \"&TEXT('1a. Defaults Segment-Ebene'!D371,\"0.000\")&\" \"&E371","v":"Standardwert: 0.025 CHF/km"}]
[null,null,{"$f":"IF('Eingaben (Inputs)'!C372<>\"\",'Eingaben (Inputs)'!C372,\"\")","v":"Restwert E-Fahrzeug"},{"$f":"_xlfn.LET(_xlpm.class,D348,_xlpm.km,ROUNDUP(D355*IF(D342=INDEX(Einsatzart,1),D356,D356+D357)*D365/12/5000,0)*5000,_xlpm.lz,D365,_xlpm.totkm,'2d. Annahmen'!$B$76:$G$76,_xlpm.totlz,'2d. Annahmen'!$A$77:$A$82,_xlpm.rkm,MIN(MAX(_xlpm.km,MIN(_xlpm.totkm)),MAX(_xlpm.totkm)),_xlpm.r,_xlfn.XMATCH(_xlpm.lz,_xlpm.totlz),_xlpm.c,_xlfn.XMATCH(_xlpm.rkm,_xlpm.totkm),_xlpm.delta,1+INDEX('2d. Annahmen'!$N$4:$N$7,_xlfn.XMATCH(_xlpm.class,Grösse)),_xlpm.delta*INDEX('2d. Annahmen'!$B$77:$G$82,_xlpm.r,_xlpm.c))","v":{"v":0.30658197222222217,"d":"31%"}},{"$f":"IF('Eingaben (Inputs)'!E372<>\"\",'Eingaben (Inputs)'!E372,\"\")","v":""},{"$f":"\"Standardwert: \"&TEXT('1a. Defaults Segment-Ebene'!D372,\"##0.0%\")","v":"Standardwert: 30.7%"}]

{"sheet":"1b. Corrected Inputs Segment","index":4,"n_rows":372,"n_cols":11,"rows_kept":372,"hidden":true}
{"$rows_empty":8}
[null,"1)",{"$f":"IF('Eingaben (Inputs)'!C9<>\"\",'Eingaben (Inputs)'!C9,\"\")","v":"Flottenstruktur"},null,{"$f":"IF('Eingaben (Inputs)'!E9<>\"\",'Eingaben (Inputs)'!E9,\"\")","v":""}]
[null,null,{"$f":"IF('Eingaben (Inputs)'!C10<>\"\",'Eingaben (Inputs)'!C10,\"\")","v":""},null,{"$f":"IF('Eingaben (Inputs)'!E10<>\"\",'Eingaben (Inputs)'!E10,\"\")","v":""}]
[null,null,{"$f":"IF('Eingaben (Inputs)'!C11<>\"\",'Eingaben (Inputs)'!C11,\"\")","v":"Flotte"},null,{"$f":"IF('Eingaben (Inputs)'!E11<>\"\",'Eingaben (Inputs)'!E11,\"\")","v":""}]
[null,null,{"$f":"IF('Eingaben (Inputs)'!C12<>\"\",'Eingaben (Inputs)'!C12,\"\")","v":"Anzahl Segmente"},{"$f":"'Eingaben (Inputs)'!D12","v":1},{"$f":"IF('Eingaben (Inputs)'!E12<>\"\",'Eingaben (Inputs)'!E12,\"\")","v":""}]
[null,null,{"$f":"IF('Eingaben (Inputs)'!C13<>\"\",'Eingaben (Inputs)'!C13,\"\")","v":""},null,{"$f":"IF('Eingaben (Inputs)'!E13<>\"\",'Eingaben (Inputs)'!E13,\"\")","v":""}]
[null,null,{"$f":"IF('Eingaben (Inputs)'!C14<>\"\",'Eingaben (Inputs)'!C14,\"\")","v":""},null,{"$f":"IF('Eingaben (Inputs)'!E14<>\"\",'Eingaben (Inputs)'!E14,\"\")","v":""}]
[null,"2.1)",{"$f":"IF('Eingaben (Inputs)'!C15<>\"\",'Eingaben (Inputs)'!C15,\"\")","v":"Segment A"},1,{"$f":"IF('Eingaben (Inputs)'!E15<>\"\",'Eingaben (Inputs)'!E15,\"\")","v":""},null,null,"3)","Gesamte Flotte"]
[null,null,{"$f":"IF('Eingaben (Inputs)'!C16<>\"\",'Eingaben (Inputs)'!C16,\"\")","v":""},null,{"$f":"IF('Eingaben (Inputs)'!E16<>\"\",'Eingaben (Inputs)'!E16,\"\")","v":""}]
[null,null,{"$f":"IF('Eingaben (Inputs)'!C17<>\"\",'Eingaben (Inputs)'!C17,\"\")","v":"Segmentstruktur"},null,{"$f":"IF('Eingaben (Inputs)'!E17<>\"\",'Eingaben (Inputs)'!E17,\"\")","v":""},{"$nulls":3},"Energiekosten"]
[null,null,{"$f":"IF('Eingaben (Inputs)'!C18<>\"\",'Eingaben (Inputs)'!C18,\"\")","v":"Anzahl Fahrzeuge"},{"$f":"IF(D15<=$D$12,'Eingaben (Inputs)'!D18,0)","v":1},{"$f":"IF('Eingaben (Inputs)'!E18<>\"\",'Eingaben (Inputs)'!E18,\"\")","v":""},{"$nulls":3},"Treibstoffkosten",{"$f":"IF('Eingaben (Inputs)'!J18<>\"\",'Eingaben (Inputs)'!J18,'1a. Defaults Segment-Ebene'!J18)","v":{"v":1.8,"d":"1.80"}},"CHF/l"]
[null,null,{"$f":"IF('Eingaben (Inputs)'!C19<>\"\",'Eingaben (Inputs)'!C19,\"\")","v":"Einsatzart"},{"$f":"'Eingaben (Inputs)'!D19","v":"Poolfahrzeuge"},{"$f":"IF('Eingaben (Inputs)'!E19<>\"\",'Eingaben (Inputs)'!E19,\"\")","v":""},{"$nulls":3},"Durchschnittliche Stromkosten Wohnort",{"$f":"IF('Eingaben (Inputs)'!J19<>\"\",'Eingaben (Inputs)'!J19,'1a. Defaults Segment-Ebene'!J19)","v":0.24},"CHF/kWh"]
[null,null,{"$f":"IF('Eingaben (Inputs)'!C20<>\"\",'Eingaben (Inputs)'!C20,\"\")","v":"Einsatzgebiet"},{"$f":"'Eingaben (Inputs)'!D20","v":"regional"},{"$f":"IF('Eingaben (Inputs)'!E20<>\"\",'Eingaben (Inputs)'!E20,\"\")","v":""},{"$nulls":3},"Durchschnittliche Stromkosten Firmenstandort",{"$f":"IF('Eingaben (Inputs)'!J20<>\"\",'Eingaben (Inputs)'!J20,'1a. Defaults Segment-Ebene'!J20)","v":0.24},"CHF/kWh"]
[null,null,{"$f":"IF('Eingaben (Inputs)'!C21<>\"\",'Eingaben (Inputs)'!C21,\"\")","v":"Heimlademöglichkeit"},{"$f":"INDEX(OFFSET(Heimladen,0,1),_xlfn.XMATCH('Eingaben (Inputs)'!D21,Heimladen))","v":0},{"$f":"IF('Eingaben (Inputs)'!E21<>\"\",'Eingaben (Inputs)'!E21,\"\")","v":""},{"$nulls":3},"Stromkosten (öffentlich)",{"$f":"IF('Eingaben (Inputs)'!J21<>\"\",'Eingaben (Inputs)'!J21,'1a. Defaults Segment-Ebene'!J21)","v":0.55},"CHF/kWh"]
[null,null,{"$f":"IF('Eingaben (Inputs)'!C22<>\"\",'Eingaben (Inputs)'!C22,\"\")","v":""},null,{"$f":"IF('Eingaben (Inputs)'!E22<>\"\",'Eingaben (Inputs)'!E22,\"\")","v":""}]
[null,null,{"$f":"IF('Eingaben (Inputs)'!C23<>\"\",'Eingaben (Inputs)'!C23,\"\")","v":"Fahrzeugdaten"},null,{"$f":"IF('Eingaben (Inputs)'!E23<>\"\",'Eingaben (Inputs)'!E23,\"\")","v":""},{"$nulls":3},"Ladegeräte"]
[null,null,{"$f":"IF('Eingaben (Inputs)'!C24<>\"\",'Eingaben (Inputs)'!C24,\"\")","v":"Fahrzeuggrösse"},{"$f":"'Eingaben (Inputs)'!D24","v":"Mittelklasse"},{"$f":"IF('Eingaben (Inputs)'!E24<>\"\",'Eingaben (Inputs)'!E24,\"\")","v":""},{"$nulls":3},"Max. Ladeleistung pro Ladepunkt (Wohnort)",{"$f":"IF('Eingaben (Inputs)'!J24<>\"\",'Eingaben (Inputs)'!J24,'1a. Defaults Segment-Ebene'!J24)","v":11},"kW"]
[null,null,{"$f":"IF('Eingaben (Inputs)'!C25<>\"\",'Eingaben (Inputs)'!C25,\"\")","v":"Treibstoffverbrauch Verbrenner"},{"$f":"IF('Eingaben (Inputs)'!D25<>\"\",'Eingaben (Inputs)'!D25,'1a. Defaults Segment-Ebene'!D25)","v":5.8},{"$f":"IF('Eingaben (Inputs)'!E25<>\"\",'Eingaben (Inputs)'!E25,\"\")","v":"l/100 km"},{"$nulls":3},"Max. Ladeleistung pro Ladepunkt (Firmenstandort, AC)",{"$f":"IF('Eingaben (Inputs)'!J25<>\"\",'Eingaben (Inputs)'!J25,'1a. Defaults Segment-Ebene'!J25)","v":11},"kW"]
[null,null,{"$f":"IF('Eingaben (Inputs)'!C26<>\"\",'Eingaben (Inputs)'!C26,\"\")","v":"Energieverbrauch E-Fahrzeug"},{"$f":"IF('Eingaben (Inputs)'!D26<>\"\",'Eingaben (Inputs)'!D26,'1a. Defaults Segment-Ebene'!D26)","v":15.1},{"$f":"IF('Eingaben (Inputs)'!E26<>\"\",'Eingaben (Inputs)'!E26,\"\")","v":"kWh/100 km"},{"$nulls":3},"Max. Ladeleistung pro Ladepunkt (Firmenstandort, DC)",{"$f":"IF('Eingaben (Inputs)'!J26<>\"\",'Eingaben (Inputs)'!J26,'1a. Defaults Segment-Ebene'!J26)","v":250},"kW"]
[null,null,{"$f":"IF('Eingaben (Inputs)'!C27<>\"\",'Eingaben (Inputs)'!C27,\"\")","v":"Batteriekapazität (netto)"},{"$f":"IF('Eingaben (Inputs)'!D27<>\"\",'Eingaben (Inputs)'!D27,'1a. Defaults Segment-Ebene'!D27)","v":58.625},{"$f":"IF('Eingaben (Inputs)'!E27<>\"\",'Eingaben (Inputs)'!E27,\"\")","v":"kWh"},{"$nulls":3},"Anschlusskapazität (Firmenstandort, heute)",{"$f":"IF('Eingaben (Inputs)'!J27<>\"\",'Eingaben (Inputs)'!J27,'1a. Defaults Segment-Ebene'!J27)","v":{"v":40,"d":"40.00"}},"kW"]
[null,null,{"$f":"IF('Eingaben (Inputs)'!C28<>\"\",'Eingaben (Inputs)'!C28,\"\")","v":""},null,{"$f":"IF('Eingaben (Inputs)'!E28<>\"\",'Eingaben (Inputs)'!E28,\"\")","v":""},{"$nulls":3},"Fahrzeuge pro Ladepunkt (Wohnort, AC)",{"$f":"IF('Eingaben (Inputs)'!J28<>\"\",'Eingaben (Inputs)'!J28,'1a. Defaults Segment-Ebene'!J28)","v":1}]
[null,null,{"$f":"IF('Eingaben (Inputs)'!C29<>\"\",'Eingaben (Inputs)'!C29,\"\")","v":"Fahr- und Nutzungsprofil (Angabe pro Fahrzeug)"},null,{"$f":"IF('Eingaben (Inputs)'!E29<>\"\",'Eingaben (Inputs)'!E29,\"\")","v":""},{"$nulls":3},"Fahrzeuge pro Ladepunkt (Firmenstandort, AC)",{"$f":"IF('Eingaben (Inputs)'!J29<>\"\",'Eingaben (Inputs)'!J29,'1a. Defaults Segment-Ebene'!J29)","v":1}]
[null,null,{"$f":"IF('Eingaben (Inputs)'!C30<>\"\",'Eingaben (Inputs)'!C30,\"\")","v":"Nutzungsmuster"},{"$f":"'Eingaben (Inputs)'!D30","v":"Werktagsbetrieb"},{"$f":"IF('Eingaben (Inputs)'!E30<>\"\",'Eingaben (Inputs)'!E30,\"\")","v":""}]
[null,null,{"$f":"IF('Eingaben (Inputs)'!C31<>\"\",'Eingaben (Inputs)'!C31,\"\")","v":"Anzahl Arbeitstage pro Jahr"},{"$f":"IF('Eingaben (Inputs)'!D31<>\"\",'Eingaben (Inputs)'!D31,'1a. Defaults Segment-Ebene'!D31)","v":260},{"$f":"IF('Eingaben (Inputs)'!E31<>\"\",'Eingaben (Inputs)'!E31,\"\")","v":""}]
[null,null,{"$f":"IF('Eingaben (Inputs)'!C32<>\"\",'Eingaben (Inputs)'!C32,\"\")","v":"Fahrdistanz während der Arbeitszeit"},{"$f":"IF('Eingaben (Inputs)'!D32<>\"\",'Eingaben (Inputs)'!D32,'1a. Defaults Segment-Ebene'!D32)","v":100},{"$f":"IF('Eingaben (Inputs)'!E32<>\"\",'Eingaben (Inputs)'!E32,\"\")","v":"km/Tag"}]
[null,null,{"$f":"IF('Eingaben (Inputs)'!C33<>\"\",'Eingaben (Inputs)'!C33,\"\")","v":"Pendeldistanz (Hin- und Rückfahrt)"},{"$f":"(_xlfn.XMATCH(D19,Einsatzart)-1)*IF('Eingaben (Inputs)'!D33<>\"\",'Eingaben (Inputs)'!D33,'1a. Defaults Segment-Ebene'!D33)","v":0},{"$f":"IF('Eingaben (Inputs)'!E33<>\"\",'Eingaben (Inputs)'!E33,\"\")","v":"km/Tag"}]
[null,null,{"$f":"IF('Eingaben (Inputs)'!C34<>\"\",'Eingaben (Inputs)'!C34,\"\")","v":"Anzahl Einsätze pro Tag"},{"$f":"IF('Eingaben (Inputs)'!D34<>\"\",'Eingaben (Inputs)'!D34,'1a. Defaults Segment-Ebene'!D34)","v":1},{"$f":"IF('Eingaben (Inputs)'!E34<>\"\",'Eingaben (Inputs)'!E34,\"\")","v":""}]
[null,null,{"$f":"IF('Eingaben (Inputs)'!C35<>\"\",'Eingaben (Inputs)'!C35,\"\")","v":"Anzahl Pausen pro Tag"},{"$f":"'Eingaben (Inputs)'!D35","v":1},{"$f":"IF('Eingaben (Inputs)'!E35<>\"\",'Eingaben (Inputs)'!E35,\"\")","v":""}]
[null,null,{"$f":"IF('Eingaben (Inputs)'!C36<>\"\",'Eingaben (Inputs)'!C36,\"\")","v":"Standzeit pro Pause am Firmenstandort"},{"$f":"IF('Eingaben (Inputs)'!D36<>\"\",'Eingaben (Inputs)'!D36,'1a. Defaults Segment-Ebene'!D36)","v":1},{"$f":"IF('Eingaben (Inputs)'!E36<>\"\",'Eingaben (Inputs)'!E36,\"\")","v":"Stunden"}]
[null,null,{"$f":"IF('Eingaben (Inputs)'!C37<>\"\",'Eingaben (Inputs)'!C37,\"\")","v":"Standzeit über Nacht"},{"$f":"IF('Eingaben (Inputs)'!D37<>\"\",'Eingaben (Inputs)'!D37,'1a. Defaults Segment-Ebene'!D37)*IF(AND(_xlfn.XMATCH(D19,Einsatzart)=2,NOT(D21)),0,1)","v":8},{"$f":"IF('Eingaben (Inputs)'!E37<>\"\",'Eingaben (Inputs)'!E37,\"\")","v":"Stunden"}]
[null,null,{"$f":"IF('Eingaben (Inputs)'!C38<>\"\",'Eingaben (Inputs)'!C38,\"\")","v":"Fahrzeuge pro Ladepunkt, Firmenstandort (tagsüber)"},{"$f":"IF('Eingaben (Inputs)'!D38<>\"\",'Eingaben (Inputs)'!D38,'1a. Defaults Segment-Ebene'!D38)","v":1},{"$f":"IF('Eingaben (Inputs)'!E38<>\"\",'Eingaben (Inputs)'!E38,\"\")","v":""}]
[null,null,{"$f":"IF('Eingaben (Inputs)'!C39<>\"\",'Eingaben (Inputs)'!C39,\"\")","v":""},null,{"$f":"IF('Eingaben (Inputs)'!E39<>\"\",'Eingaben (Inputs)'!E39,\"\")","v":""}]
[null,null,{"$f":"IF('Eingaben (Inputs)'!C40<>\"\",'Eingaben (Inputs)'!C40,\"\")","v":"Kosten (Angabe pro Fahrzeug)"},null,{"$f":"IF('Eingaben (Inputs)'!E40<>\"\",'Eingaben (Inputs)'!E40,\"\")","v":""}]
[null,null,{"$f":"IF('Eingaben (Inputs)'!C41<>\"\",'Eingaben (Inputs)'!C41,\"\")","v":"Laufzeit"},{"$f":"IF('Eingaben (Inputs)'!D41<>\"\",'Eingaben (Inputs)'!D41,'1a. Defaults Segment-Ebene'!D41)","v":48},{"$f":"IF('Eingaben (Inputs)'!E41<>\"\",'Eingaben (Inputs)'!E41,\"\")","v":"Monate"}]
[null,null,{"$f":"IF('Eingaben (Inputs)'!C42<>\"\",'Eingaben (Inputs)'!C42,\"\")","v":"Leasing-Zinssatz"},{"$f":"IF('Eingaben (Inputs)'!D42<>\"\",'Eingaben (Inputs)'!D42,'1a. Defaults Segment-Ebene'!D42)","v":{"v":0.03,"d":"3.0%"}},{"$f":"IF('Eingaben (Inputs)'!E42<>\"\",'Eingaben (Inputs)'!E42,\"\")","v":""}]
[null,null,{"$f":"IF('Eingaben (Inputs)'!C43<>\"\",'Eingaben (Inputs)'!C43,\"\")","v":"Anschaffungspreis inkl. Flottenrabatt Verbrenner"},{"$f":"IF('Eingaben (Inputs)'!D43<>\"\",'Eingaben (Inputs)'!D43,'1a. Defaults Segment-Ebene'!D43)","v":{"v":27219.464999999997,"d":"27,219"}},{"$f":"IF('Eingaben (Inputs)'!E43<>\"\",'Eingaben (Inputs)'!E43,\"\")","v":"CHF"}]
[null,null,{"$f":"IF('Eingaben (Inputs)'!C44<>\"\",'Eingaben (Inputs)'!C44,\"\")","v":"Service- und Reparaturkosten Verbrenner"},{"$f":"IF('Eingaben (Inputs)'!D44<>\"\",'Eingaben (Inputs)'!D44,'1a. Defaults Segment-Ebene'!D44)","v":0.05},{"$f":"IF('Eingaben (Inputs)'!E44<>\"\",'Eingaben (Inputs)'!E44,\"\")","v":"CHF/km"}]
[null,null,{"$f":"IF('Eingaben (Inputs)'!C45<>\"\",'Eingaben (Inputs)'!C45,\"\")","v":"Restwert Verbrenner"},{"$f":"IF('Eingaben (Inputs)'!D45<>\"\",'Eingaben (Inputs)'!D45,'1a. Defaults Segment-Ebene'!D45)","v":{"v":0.31606388888888887,"d":"32%"}},{"$f":"IF('Eingaben (Inputs)'!E45<>\"\",'Eingaben (Inputs)'!E45,\"\")","v":""}]
[null,null,{"$f":"IF('Eingaben (Inputs)'!C46<>\"\",'Eingaben (Inputs)'!C46,\"\")","v":"Anschaffungspreis inkl. Flottenrabatt E-Fahrzeug"},{"$f":"IF('Eingaben (Inputs)'!D46<>\"\",'Eingaben (Inputs)'!D46,'1a. Defaults Segment-Ebene'!D46)","v":{"v":28810.890000000003,"d":"28,811"}},{"$f":"IF('Eingaben (Inputs)'!E46<>\"\",'Eingaben (Inputs)'!E46,\"\")","v":"CHF"}]
[null,null,{"$f":"IF('Eingaben (Inputs)'!C47<>\"\",'Eingaben (Inputs)'!C47,\"\")","v":"Service- und Reparaturkosten E-Fahrzeug"},{"$f":"IF('Eingaben (Inputs)'!D47<>\"\",'Eingaben (Inputs)'!D47,'1a. Defaults Segment-Ebene'!D47)","v":0.025},{"$f":"IF('Eingaben (Inputs)'!E47<>\"\",'Eingaben (Inputs)'!E47,\"\")","v":"CHF/km"}]
[null,null,{"$f":"IF('Eingaben (Inputs)'!C48<>\"\",'Eingaben (Inputs)'!C48,\"\")","v":"Restwert E-Fahrzeug"},{"$f":"IF('Eingaben (Inputs)'!D48<>\"\",'Eingaben (Inputs)'!D48,'1a. Defaults Segment-Ebene'!D48)","v":{"v":0.30658197222222217,"d":"31%"}},{"$f":"IF('Eingaben (Inputs)'!E48<>\"\",'Eingaben (Inputs)'!E48,\"\")","v":""}]
[null,null,{"$f":"IF('Eingaben (Inputs)'!C49<>\"\",'Eingaben (Inputs)'!C49,\"\")","v":""},null,{"$f":"IF('Eingaben (Inputs)'!E49<>\"\",'Eingaben (Inputs)'!E49,\"\")","v":""}]
[null,null,{"$f":"IF('Eingaben (Inputs)'!C50<>\"\",'Eingaben (Inputs)'!C50,\"\")","v":""},null,{"$f":"IF('Eingaben (Inputs)'!E50<>\"\",'Eingaben (Inputs)'!E50,\"\")","v":""}]
[null,"2.2)",{"$f":"IF('Eingaben (Inputs)'!C51<>\"\",'Eingaben (Inputs)'!C51,\"\")","v":"Segment B"},{"$f":"D15+1","v":2},{"$f":"IF('Eingaben (Inputs)'!E51<>\"\",'Eingaben (Inputs)'!E51,\"\")","v":""}]
[null,null,{"$f":"IF('Eingaben (Inputs)'!C52<>\"\",'Eingaben (Inputs)'!C52,\"\")","v":""},null,{"$f":"IF('Eingaben (Inputs)'!E52<>\"\",'Eingaben (Inputs)'!E52,\"\")","v":""}]
[null,null,{"$f":"IF('Eingaben (Inputs)'!C53<>\"\",'Eingaben (Inputs)'!C53,\"\")","v":"Segmentstruktur"},null,{"$f":"IF('Eingaben (Inputs)'!E53<>\"\",'Eingaben (Inputs)'!E53,\"\")","v":""}]
[null,null,{"$f":"IF('Eingaben (Inputs)'!C54<>\"\",'Eingaben (Inputs)'!C54,\"\")","v":"Anzahl Fahrzeuge"},{"$f":"IF(D51<=$D$12,'Eingaben (Inputs)'!D54,0)","v":0},{"$f":"IF('Eingaben (Inputs)'!E54<>\"\",'Eingaben (Inputs)'!E54,\"\")","v":""}]
[null,null,{"$f":"IF('Eingaben (Inputs)'!C55<>\"\",'Eingaben (Inputs)'!C55,\"\")","v":"Einsatzart"},{"$f":"'Eingaben (Inputs)'!D55","v":"Poolfahrzeuge"},{"$f":"IF('Eingaben (Inputs)'!E55<>\"\",'Eingaben (Inputs)'!E55,\"\")","v":""}]
[null,null,{"$f":"IF('Eingaben (Inputs)'!C56<>\"\",'Eingaben (Inputs)'!C56,\"\")","v":"Einsatzgebiet"},{"$f":"'Eingaben (Inputs)'!D56","v":"regional"},{"$f":"IF('Eingaben (Inputs)'!E56<>\"\",'Eingaben (Inputs)'!E56,\"\")","v":""}]
[null,null,{"$f":"IF('Eingaben (Inputs)'!C57<>\"\",'Eingaben (Inputs)'!C57,\"\")","v":"Heimlademöglichkeit"},{"$f":"INDEX(OFFSET(Heimladen,0,1),_xlfn.XMATCH('Eingaben (Inputs)'!D57,Heimladen))","v":0},{"$f":"IF('Eingaben (Inputs)'!E57<>\"\",'Eingaben (Inputs)'!E57,\"\")","v":""}]
[null,null,{"$f":"IF('Eingaben (Inputs)'!C58<>\"\",'Eingaben (Inputs)'!C58,\"\")","v":""},null,{"$f":"IF('Eingaben (Inputs)'!E58<>\"\",'Eingaben (Inputs)'!E58,\"\")","v":""}]
[null,null,{"$f":"IF('Eingaben (Inputs)'!C59<>\"\",'Eingaben (Inputs)'!C59,\"\")","v":"Fahrzeugdaten"},null,{"$f":"IF('Eingaben (Inputs)'!E59<>\"\",'Eingaben (Inputs)'!E59,\"\")","v":""}]
[null,null,{"$f":"IF('Eingaben (Inputs)'!C60<>\"\",'Eingaben (Inputs)'!C60,\"\")","v":"Fahrzeuggrösse"},{"$f":"'Eingaben (Inputs)'!D60","v":"Mittelklasse"},{"$f":"IF('Eingaben (Inputs)'!E60<>\"\",'Eingaben (Inputs)'!E60,\"\")","v":""}]
[null,null,{"$f":"IF('Eingaben (Inputs)'!C61<>\"\",'Eingaben (Inputs)'!C61,\"\")","v":"Treibstoffverbrauch Verbrenner"},{"$f":"IF('Eingaben (Inputs)'!D61<>\"\",'Eingaben (Inputs)'!D61,'1a. Defaults Segment-Ebene'!D61)","v":5.8},{"$f":"IF('Eingaben (Inputs)'!E61<>\"\",'Eingaben (Inputs)'!E61,\"\")","v":"l/100 km"}]
[null,null,{"$f":"IF('Eingaben (Inputs)'!C62<>\"\",'Eingaben (Inputs)'!C62,\"\")","v":"Energieverbrauch E-Fahrzeug"},{"$f":"IF('Eingaben (Inputs)'!D62<>\"\",'Eingaben (Inputs)'!D62,'1a. Defaults Segment-Ebene'!D62)","v":15.1},{"$f":"IF('Eingaben (Inputs)'!E62<>\"\",'Eingaben (Inputs)'!E62,\"\")","v":"kWh/100 km"}]
[null,null,{"$f":"IF('Eingaben (Inputs)'!C63<>\"\",'Eingaben (Inputs)'!C63,\"\")","v":"Batteriekapazität (netto)"},{"$f":"IF('Eingaben (Inputs)'!D63<>\"\",'Eingaben (Inputs)'!D63,'1a. Defaults Segment-Ebene'!D63)","v":58.625},{"$f":"IF('Eingaben (Inputs)'!E63<>\"\",'Eingaben (Inputs)'!E63,\"\")","v":"kWh"}]
[null,null,{"$f":"IF('Eingaben (Inputs)'!C64<>\"\",'Eingaben (Inputs)'!C64,\"\")","v":""},null,{"$f":"IF('Eingaben (Inputs)'!E64<>\"\",'Eingaben (Inputs)'!E64,\"\")","v":""}]
[null,null,{"$f":"IF('Eingaben (Inputs)'!C65<>\"\",'Eingaben (Inputs)'!C65,\"\")","v":"Fahr- und Nutzungsprofil (Angabe pro Fahrzeug)"},null,{"$f":"IF('Eingaben (Inputs)'!E65<>\"\",'Eingaben (Inputs)'!E65,\"\")","v":""}]
[null,null,{"$f":"IF('Eingaben (Inputs)'!C66<>\"\",'Eingaben (Inputs)'!C66,\"\")","v":"Nutzungsmuster"},{"$f":"'Eingaben (Inputs)'!D66","v":"Werktagsbetrieb"},{"$f":"IF('Eingaben (Inputs)'!E66<>\"\",'Eingaben (Inputs)'!E66,\"\")","v":""}]
[null,null,{"$f":"IF('Eingaben (Inputs)'!C67<>\"\",'Eingaben (Inputs)'!C67,\"\")","v":"Anzahl Arbeitstage pro Jahr"},{"$f":"IF('Eingaben (Inputs)'!D67<>\"\",'Eingaben (Inputs)'!D67,'1a. Defaults Segment-Ebene'!D67)","v":260},{"$f":"IF('Eingaben (Inputs)'!E67<>\"\",'Eingaben (Inputs)'!E67,\"\")","v":""}]
[null,null,{"$f":"IF('Eingaben (Inputs)'!C68<>\"\",'Eingaben (Inputs)'!C68,\"\")","v":"Fahrdistanz während der Arbeitszeit"},{"$f":"IF('Eingaben (Inputs)'!D68<>\"\",'Eingaben (Inputs)'!D68,'1a. Defaults Segment-Ebene'!D68)","v":100},{"$f":"IF('Eingaben (Inputs)'!E68<>\"\",'Eingaben (Inputs)'!E68,\"\")","v":"km/Tag"}]
[null,null,{"$f":"IF('Eingaben (Inputs)'!C69<>\"\",'Eingaben (Inputs)'!C69,\"\")","v":"Pendeldistanz (Hin- und Rückfahrt)"},{"$f":"(_xlfn.XMATCH(D55,Einsatzart)-1)*IF('Eingaben (Inputs)'!D69<>\"\",'Eingaben (Inputs)'!D69,'1a. Defaults Segment-Ebene'!D69)","v":0},{"$f":"IF('Eingaben (Inputs)'!E69<>\"\",'Eingaben (Inputs)'!E69,\"\")","v":"km/Tag"}]
[null,null,{"$f":"IF('Eingaben (Inputs)'!C70<>\"\",'Eingaben (Inputs)'!C70,\"\")","v":"Anzahl Einsätze pro Tag"},{"$f":"IF('Eingaben (Inputs)'!D70<>\"\",'Eingaben (Inputs)'!D70,'1a. Defaults Segment-Ebene'!D70)","v":1},{"$f":"IF('Eingaben (Inputs)'!E70<>\"\",'Eingaben (Inputs)'!E70,\"\")","v":""}]
[null,null,{"$f":"IF('Eingaben (Inputs)'!C71<>\"\",'Eingaben (Inputs)'!C71,\"\")","v":"Anzahl Pausen pro Tag"},{"$f":"'Eingaben (Inputs)'!D71","v":1},{"$f":"IF('Eingaben (Inputs)'!E71<>\"\",'Eingaben (Inputs)'!E71,\"\")","v":""}]
[null,null,{"$f":"IF('Eingaben (Inputs)'!C72<>\"\",'Eingaben (Inputs)'!C72,\"\")","v":"Standzeit pro Pause am Firmenstandort"},{"$f":"IF('Eingaben (Inputs)'!D72<>\"\",'Eingaben (Inputs)'!D72,'1a. Defaults Segment-Ebene'!D72)","v":1},{"$f":"IF('Eingaben (Inputs)'!E72<>\"\",'Eingaben (Inputs)'!E72,\"\")","v":"Stunden"}]
[null,null,{"$f":"IF('Eingaben (Inputs)'!C73<>\"\",'Eingaben (Inputs)'!C73,\"\")","v":"Standzeit über Nacht"},{"$f":"IF('Eingaben (Inputs)'!D73<>\"\",'Eingaben (Inputs)'!D73,'1a. Defaults Segment-Ebene'!D73)*IF(AND(_xlfn.XMATCH(D55,Einsatzart)=2,NOT(D57)),0,1)","v":8},{"$f":"IF('Eingaben (Inputs)'!E73<>\"\",'Eingaben (Inputs)'!E73,\"\")","v":"Stunden"}]
[null,null,{"$f":"IF('Eingaben (Inputs)'!C74<>\"\",'Eingaben (Inputs)'!C74,\"\")","v":"Fahrzeuge pro Ladepunkt, Firmenstandort (tagsüber)"},{"$f":"IF('Eingaben (Inputs)'!D74<>\"\",'Eingaben (Inputs)'!D74,'1a. Defaults Segment-Ebene'!D74)","v":1},{"$f":"IF('Eingaben (Inputs)'!E74<>\"\",'Eingaben (Inputs)'!E74,\"\")","v":""}]
[null,null,{"$f":"IF('Eingaben (Inputs)'!C75<>\"\",'Eingaben (Inputs)'!C75,\"\")","v":""},null,{"$f":"IF('Eingaben (Inputs)'!E75<>\"\",'Eingaben (Inputs)'!E75,\"\")","v":""}]
[null,null,{"$f":"IF('Eingaben (Inputs)'!C76<>\"\",'Eingaben (Inputs)'!C76,\"\")","v":"Kosten (Angabe pro Fahrzeug)"},null,{"$f":"IF('Eingaben (Inputs)'!E76<>\"\",'Eingaben (Inputs)'!E76,\"\")","v":""}]
[null,null,{"$f":"IF('Eingaben (Inputs)'!C77<>\"\",'Eingaben (Inputs)'!C77,\"\")","v":"Laufzeit"},{"$f":"IF('Eingaben (Inputs)'!D77<>\"\",'Eingaben (Inputs)'!D77,'1a. Defaults Segment-Ebene'!D77)","v":48},{"$f":"IF('Eingaben (Inputs)'!E77<>\"\",'Eingaben (Inputs)'!E77,\"\")","v":"Monate"}]
[null,null,{"$f":"IF('Eingaben (Inputs)'!C78<>\"\",'Eingaben (Inputs)'!C78,\"\")","v":"Leasing-Zinssatz"},{"$f":"IF('Eingaben (Inputs)'!D78<>\"\",'Eingaben (Inputs)'!D78,'1a. Defaults Segment-Ebene'!D78)","v":{"v":0.03,"d":"3.0%"}},{"$f":"IF('Eingaben (Inputs)'!E78<>\"\",'Eingaben (Inputs)'!E78,\"\")","v":""}]
[null,null,{"$f":"IF('Eingaben (Inputs)'!C79<>\"\",'Eingaben (Inputs)'!C79,\"\")","v":"Anschaffungspreis inkl. Flottenrabatt Verbrenner"},{"$f":"IF('Eingaben (Inputs)'!D79<>\"\",'Eingaben (Inputs)'!D79,'1a. Defaults Segment-Ebene'!D79)","v":{"v":27219.464999999997,"d":"27,219"}},{"$f":"IF('Eingaben (Inputs)'!E79<>\"\",'Eingaben (Inputs)'!E79,\"\")","v":"CHF"}]
[null,null,{"$f":"IF('Eingaben (Inputs)'!C80<>\"\",'Eingaben (Inputs)'!C80,\"\")","v":"Service- und Reparaturkosten Verbrenner"},{"$f":"IF('Eingaben (Inputs)'!D80<>\"\",'Eingaben (Inputs)'!D80,'1a. Defaults Segment-Ebene'!D80)","v":0.05},{"$f":"IF('Eingaben (Inputs)'!E80<>\"\",'Eingaben (Inputs)'!E80,\"\")","v":"CHF/km"}]
[null,null,{"$f":"IF('Eingaben (Inputs)'!C81<>\"\",'Eingaben (Inputs)'!C81,\"\")","v":"Restwert Verbrenner"},{"$f":"IF('Eingaben (Inputs)'!D81<>\"\",'Eingaben (Inputs)'!D81,'1a. Defaults Segment-Ebene'!D81)","v":{"v":0.31606388888888887,"d":"32%"}},{"$f":"IF('Eingaben (Inputs)'!E81<>\"\",'Eingaben (Inputs)'!E81,\"\")","v":""}]
[null,null,{"$f":"IF('Eingaben (Inputs)'!C82<>\"\",'Eingaben (Inputs)'!C82,\"\")","v":"Anschaffungspreis inkl. Flottenrabatt E-Fahrzeug"},{"$f":"IF('Eingaben (Inputs)'!D82<>\"\",'Eingaben (Inputs)'!D82,'1a. Defaults Segment-Ebene'!D82)","v":{"v":28810.890000000003,"d":"28,811"}},{"$f":"IF('Eingaben (Inputs)'!E82<>\"\",'Eingaben (Inputs)'!E82,\"\")","v":"CHF"}]
[null,null,{"$f":"IF('Eingaben (Inputs)'!C83<>\"\",'Eingaben (Inputs)'!C83,\"\")","v":"Service- und Reparaturkosten E-Fahrzeug"},{"$f":"IF('Eingaben (Inputs)'!D83<>\"\",'Eingaben (Inputs)'!D83,'1a. Defaults Segment-Ebene'!D83)","v":0.025},{"$f":"IF('Eingaben (Inputs)'!E83<>\"\",'Eingaben (Inputs)'!E83,\"\")","v":"CHF/km"}]
[null,null,{"$f":"IF('Eingaben (Inputs)'!C84<>\"\",'Eingaben (Inputs)'!C84,\"\")","v":"Restwert E-Fahrzeug"},{"$f":"IF('Eingaben (Inputs)'!D84<>\"\",'Eingaben (Inputs)'!D84,'1a. Defaults Segment-Ebene'!D84)","v":{"v":0.30658197222222217,"d":"31%"}},{"$f":"IF('Eingaben (Inputs)'!E84<>\"\",'Eingaben (Inputs)'!E84,\"\")","v":""}]
[null,null,{"$f":"IF('Eingaben (Inputs)'!C85<>\"\",'Eingaben (Inputs)'!C85,\"\")","v":""},null,{"$f":"IF('Eingaben (Inputs)'!E85<>\"\",'Eingaben (Inputs)'!E85,\"\")","v":""}]
[null,null,{"$f":"IF('Eingaben (Inputs)'!C86<>\"\",'Eingaben (Inputs)'!C86,\"\")","v":""},null,{"$f":"IF('Eingaben (Inputs)'!E86<>\"\",'Eingaben (Inputs)'!E86,\"\")","v":""}]
[null,"2.3)",{"$f":"IF('Eingaben (Inputs)'!C87<>\"\",'Eingaben (Inputs)'!C87,\"\")","v":"Segment C"},{"$f":"D51+1","v":3},{"$f":"IF('Eingaben (Inputs)'!E87<>\"\",'Eingaben (Inputs)'!E87,\"\")","v":""}]
[null,null,{"$f":"IF('Eingaben (Inputs)'!C88<>\"\",'Eingaben (Inputs)'!C88,\"\")","v":""},null,{"$f":"IF('Eingaben (Inputs)'!E88<>\"\",'Eingaben (Inputs)'!E88,\"\")","v":""}]
[null,null,{"$f":"IF('Eingaben (Inputs)'!C89<>\"\",'Eingaben (Inputs)'!C89,\"\")","v":"Segmentstruktur"},null,{"$f":"IF('Eingaben (Inputs)'!E89<>\"\",'Eingaben (Inputs)'!E89,\"\")","v":""}]
[null,null,{"$f":"IF('Eingaben (Inputs)'!C90<>\"\",'Eingaben (Inputs)'!C90,\"\")","v":"Anzahl Fahrzeuge"},{"$f":"IF(D87<=$D$12,'Eingaben (Inputs)'!D90,0)","v":0},{"$f":"IF('Eingaben (Inputs)'!E90<>\"\",'Eingaben (Inputs)'!E90,\"\")","v":""}]
[null,null,{"$f":"IF('Eingaben (Inputs)'!C91<>\"\",'Eingaben (Inputs)'!C91,\"\")","v":"Einsatzart"},{"$f":"'Eingaben (Inputs)'!D91","v":"Poolfahrzeuge"},{"$f":"IF('Eingaben (Inputs)'!E91<>\"\",'Eingaben (Inputs)'!E91,\"\")","v":""}]
[null,null,{"$f":"IF('Eingaben (Inputs)'!C92<>\"\",'Eingaben (Inputs)'!C92,\"\")","v":"Einsatzgebiet"},{"$f":"'Eingaben (Inputs)'!D92","v":"regional"},{"$f":"IF('Eingaben (Inputs)'!E92<>\"\",'Eingaben (Inputs)'!E92,\"\")","v":""}]
[null,null,{"$f":"IF('Eingaben (Inputs)'!C93<>\"\",'Eingaben (Inputs)'!C93,\"\")","v":"Heimlademöglichkeit"},{"$f":"INDEX(OFFSET(Heimladen,0,1),_xlfn.XMATCH('Eingaben (Inputs)'!D93,Heimladen))","v":0},{"$f":"IF('Eingaben (Inputs)'!E93<>\"\",'Eingaben (Inputs)'!E93,\"\")","v":""}]
[null,null,{"$f":"IF('Eingaben (Inputs)'!C94<>\"\",'Eingaben (Inputs)'!C94,\"\")","v":""},null,{"$f":"IF('Eingaben (Inputs)'!E94<>\"\",'Eingaben (Inputs)'!E94,\"\")","v":""}]
[null,null,{"$f":"IF('Eingaben (Inputs)'!C95<>\"\",'Eingaben (Inputs)'!C95,\"\")","v":"Fahrzeugdaten"},null,{"$f":"IF('Eingaben (Inputs)'!E95<>\"\",'Eingaben (Inputs)'!E95,\"\")","v":""}]
[null,null,{"$f":"IF('Eingaben (Inputs)'!C96<>\"\",'Eingaben (Inputs)'!C96,\"\")","v":"Fahrzeuggrösse"},{"$f":"'Eingaben (Inputs)'!D96","v":"Mittelklasse"},{"$f":"IF('Eingaben (Inputs)'!E96<>\"\",'Eingaben (Inputs)'!E96,\"\")","v":""}]
[null,null,{"$f":"IF('Eingaben (Inputs)'!C97<>\"\",'Eingaben (Inputs)'!C97,\"\")","v":"Treibstoffverbrauch Verbrenner"},{"$f":"IF('Eingaben (Inputs)'!D97<>\"\",'Eingaben (Inputs)'!D97,'1a. Defaults Segment-Ebene'!D97)","v":5.8},{"$f":"IF('Eingaben (Inputs)'!E97<>\"\",'Eingaben (Inputs)'!E97,\"\")","v":"l/100 km"}]
[null,null,{"$f":"IF('Eingaben (Inputs)'!C98<>\"\",'Eingaben (Inputs)'!C98,\"\")","v":"Energieverbrauch E-Fahrzeug"},{"$f":"IF('Eingaben (Inputs)'!D98<>\"\",'Eingaben (Inputs)'!D98,'1a. Defaults Segment-Ebene'!D98)","v":15.1},{"$f":"IF('Eingaben (Inputs)'!E98<>\"\",'Eingaben (Inputs)'!E98,\"\")","v":"kWh/100 km"}]
[null,null,{"$f":"IF('Eingaben (Inputs)'!C99<>\"\",'Eingaben (Inputs)'!C99,\"\")","v":"Batteriekapazität (netto)"},{"$f":"IF('Eingaben (Inputs)'!D99<>\"\",'Eingaben (Inputs)'!D99,'1a. Defaults Segment-Ebene'!D99)","v":58.625},{"$f":"IF('Eingaben (Inputs)'!E99<>\"\",'Eingaben (Inputs)'!E99,\"\")","v":"kWh"}]
[null,null,{"$f":"IF('Eingaben (Inputs)'!C100<>\"\",'Eingaben (Inputs)'!C100,\"\")","v":""},null,{"$f":"IF('Eingaben (Inputs)'!E100<>\"\",'Eingaben (Inputs)'!E100,\"\")","v":""}]
[null,null,{"$f":"IF('Eingaben (Inputs)'!C101<>\"\",'Eingaben (Inputs)'!C101,\"\")","v":"Fahr- und Nutzungsprofil (Angabe pro Fahrzeug)"},null,{"$f":"IF('Eingaben (Inputs)'!E101<>\"\",'Eingaben (Inputs)'!E101,\"\")","v":""}]
[null,null,{"$f":"IF('Eingaben (Inputs)'!C102<>\"\",'Eingaben (Inputs)'!C102,\"\")","v":"Nutzungsmuster"},{"$f":"'Eingaben (Inputs)'!D102","v":"Werktagsbetrieb"},{"$f":"IF('Eingaben (Inputs)'!E102<>\"\",'Eingaben (Inputs)'!E102,\"\")","v":""}]
[null,null,{"$f":"IF('Eingaben (Inputs)'!C103<>\"\",'Eingaben (Inputs)'!C103,\"\")","v":"Anzahl Arbeitstage pro Jahr"},{"$f":"IF('Eingaben (Inputs)'!D103<>\"\",'Eingaben (Inputs)'!D103,'1a. Defaults Segment-Ebene'!D103)","v":260},{"$f":"IF('Eingaben (Inputs)'!E103<>\"\",'Eingaben (Inputs)'!E103,\"\")","v":""}]
[null,null,{"$f":"IF('Eingaben (Inputs)'!C104<>\"\",'Eingaben (Inputs)'!C104,\"\")","v":"Fahrdistanz während der Arbeitszeit"},{"$f":"IF('Eingaben (Inputs)'!D104<>\"\",'Eingaben (Inputs)'!D104,'1a. Defaults Segment-Ebene'!D104)","v":100},{"$f":"IF('Eingaben (Inputs)'!E104<>\"\",'Eingaben (Inputs)'!E104,\"\")","v":"km/Tag"}]
[null,null,{"$f":"IF('Eingaben (Inputs)'!C105<>\"\",'Eingaben (Inputs)'!C105,\"\")","v":"Pendeldistanz (Hin- und Rückfahrt)"},{"$f":"(_xlfn.XMATCH(D91,Einsatzart)-1)*IF('Eingaben (Inputs)'!D105<>\"\",'Eingaben (Inputs)'!D105,'1a. Defaults Segment-Ebene'!D105)","v":0},{"$f":"IF('Eingaben (Inputs)'!E105<>\"\",'Eingaben (Inputs)'!E105,\"\")","v":"km/Tag"}]
[null,null,{"$f":"IF('Eingaben (Inputs)'!C106<>\"\",'Eingaben (Inputs)'!C106,\"\")","v":"Anzahl Einsätze pro Tag"},{"$f":"IF('Eingaben (Inputs)'!D106<>\"\",'Eingaben (Inputs)'!D106,'1a. Defaults Segment-Ebene'!D106)","v":1},{"$f":"IF('Eingaben (Inputs)'!E106<>\"\",'Eingaben (Inputs)'!E106,\"\")","v":""}]
[null,null,{"$f":"IF('Eingaben (Inputs)'!C107<>\"\",'Eingaben (Inputs)'!C107,\"\")","v":"Anzahl Pausen pro Tag"},{"$f":"'Eingaben (Inputs)'!D107","v":1},{"$f":"IF('Eingaben (Inputs)'!E107<>\"\",'Eingaben (Inputs)'!E107,\"\")","v":""}]
[null,null,{"$f":"IF('Eingaben (Inputs)'!C108<>\"\",'Eingaben (Inputs)'!C108,\"\")","v":"Standzeit pro Pause am Firmenstandort"},{"$f":"IF('Eingaben (Inputs)'!D108<>\"\",'Eingaben (Inputs)'!D108,'1a. Defaults Segment-Ebene'!D108)","v":1},{"$f":"IF('Eingaben (Inputs)'!E108<>\"\",'Eingaben (Inputs)'!E108,\"\")","v":"Stunden"}]
[null,null,{"$f":"IF('Eingaben (Inputs)'!C109<>\"\",'Eingaben (Inputs)'!C109,\"\")","v":"Standzeit über Nacht"},{"$f":"IF('Eingaben (Inputs)'!D109<>\"\",'Eingaben (Inputs)'!D109,'1a. Defaults Segment-Ebene'!D109)*IF(AND(_xlfn.XMATCH(D91,Einsatzart)=2,NOT(D93)),0,1)","v":8},{"$f":"IF('Eingaben (Inputs)'!E109<>\"\",'Eingaben (Inputs)'!E109,\"\")","v":"Stunden"}]
[null,null,{"$f":"IF('Eingaben (Inputs)'!C110<>\"\",'Eingaben (Inputs)'!C110,\"\")","v":"Fahrzeuge pro Ladepunkt, Firmenstandort (tagsüber)"},{"$f":"IF('Eingaben (Inputs)'!D110<>\"\",'Eingaben (Inputs)'!D110,'1a. Defaults Segment-Ebene'!D110)","v":1},{"$f":"IF('Eingaben (Inputs)'!E110<>\"\",'Eingaben (Inputs)'!E110,\"\")","v":""}]
[null,null,{"$f":"IF('Eingaben (Inputs)'!C111<>\"\",'Eingaben (Inputs)'!C111,\"\")","v":""},null,{"$f":"IF('Eingaben (Inputs)'!E111<>\"\",'Eingaben (Inputs)'!E111,\"\")","v":""}]
[null,null,{"$f":"IF('Eingaben (Inputs)'!C112<>\"\",'Eingaben (Inputs)'!C112,\"\")","v":"Kosten (Angabe pro Fahrzeug)"},null,{"$f":"IF('Eingaben (Inputs)'!E112<>\"\",'Eingaben (Inputs)'!E112,\"\")","v":""}]
[null,null,{"$f":"IF('Eingaben (Inputs)'!C113<>\"\",'Eingaben (Inputs)'!C113,\"\")","v":"Laufzeit"},{"$f":"IF('Eingaben (Inputs)'!D113<>\"\",'Eingaben (Inputs)'!D113,'1a. Defaults Segment-Ebene'!D113)","v":48},{"$f":"IF('Eingaben (Inputs)'!E113<>\"\",'Eingaben (Inputs)'!E113,\"\")","v":"Monate"}]
[null,null,{"$f":"IF('Eingaben (Inputs)'!C114<>\"\",'Eingaben (Inputs)'!C114,\"\")","v":"Leasing-Zinssatz"},{"$f":"IF('Eingaben (Inputs)'!D114<>\"\",'Eingaben (Inputs)'!D114,'1a. Defaults Segment-Ebene'!D114)","v":{"v":0.03,"d":"3.0%"}},{"$f":"IF('Eingaben (Inputs)'!E114<>\"\",'Eingaben (Inputs)'!E114,\"\")","v":""}]
[null,null,{"$f":"IF('Eingaben (Inputs)'!C115<>\"\",'Eingaben (Inputs)'!C115,\"\")","v":"Anschaffungspreis inkl. Flottenrabatt Verbrenner"},{"$f":"IF('Eingaben (Inputs)'!D115<>\"\",'Eingaben (Inputs)'!D115,'1a. Defaults Segment-Ebene'!D115)","v":{"v":27219.464999999997,"d":"27,219"}},{"$f":"IF('Eingaben (Inputs)'!E115<>\"\",'Eingaben (Inputs)'!E115,\"\")","v":"CHF"}]
[null,null,{"$f":"IF('Eingaben (Inputs)'!C116<>\"\",'Eingaben (Inputs)'!C116,\"\")","v":"Service- und Reparaturkosten Verbrenner"},{"$f":"IF('Eingaben (Inputs)'!D116<>\"\",'Eingaben (Inputs)'!D116,'1a. Defaults Segment-Ebene'!D116)","v":0.05},{"$f":"IF('Eingaben (Inputs)'!E116<>\"\",'Eingaben (Inputs)'!E116,\"\")","v":"CHF/km"}]
[null,null,{"$f":"IF('Eingaben (Inputs)'!C117<>\"\",'Eingaben (Inputs)'!C117,\"\")","v":"Restwert Verbrenner"},{"$f":"IF('Eingaben (Inputs)'!D117<>\"\",'Eingaben (Inputs)'!D117,'1a. Defaults Segment-Ebene'!D117)","v":{"v":0.31606388888888887,"d":"32%"}},{"$f":"IF('Eingaben (Inputs)'!E117<>\"\",'Eingaben (Inputs)'!E117,\"\")","v":""}]
[null,null,{"$f":"IF('Eingaben (Inputs)'!C118<>\"\",'Eingaben (Inputs)'!C118,\"\")","v":"Anschaffungspreis inkl. Flottenrabatt E-Fahrzeug"},{"$f":"IF('Eingaben (Inputs)'!D118<>\"\",'Eingaben (Inputs)'!D118,'1a. Defaults Segment-Ebene'!D118)","v":{"v":28810.890000000003,"d":"28,811"}},{"$f":"IF('Eingaben (Inputs)'!E118<>\"\",'Eingaben (Inputs)'!E118,\"\")","v":"CHF"}]
[null,null,{"$f":"IF('Eingaben (Inputs)'!C119<>\"\",'Eingaben (Inputs)'!C119,\"\")","v":"Service- und Reparaturkosten E-Fahrzeug"},{"$f":"IF('Eingaben (Inputs)'!D119<>\"\",'Eingaben (Inputs)'!D119,'1a. Defaults Segment-Ebene'!D119)","v":0.025},{"$f":"IF('Eingaben (Inputs)'!E119<>\"\",'Eingaben (Inputs)'!E119,\"\")","v":"CHF/km"}]
[null,null,{"$f":"IF('Eingaben (Inputs)'!C120<>\"\",'Eingaben (Inputs)'!C120,\"\")","v":"Restwert E-Fahrzeug"},{"$f":"IF('Eingaben (Inputs)'!D120<>\"\",'Eingaben (Inputs)'!D120,'1a. Defaults Segment-Ebene'!D120)","v":{"v":0.30658197222222217,"d":"31%"}},{"$f":"IF('Eingaben (Inputs)'!E120<>\"\",'Eingaben (Inputs)'!E120,\"\")","v":""}]
[null,null,{"$f":"IF('Eingaben (Inputs)'!C121<>\"\",'Eingaben (Inputs)'!C121,\"\")","v":""},null,{"$f":"IF('Eingaben (Inputs)'!E121<>\"\",'Eingaben (Inputs)'!E121,\"\")","v":""}]
[null,null,{"$f":"IF('Eingaben (Inputs)'!C122<>\"\",'Eingaben (Inputs)'!C122,\"\")","v":""},null,{"$f":"IF('Eingaben (Inputs)'!E122<>\"\",'Eingaben (Inputs)'!E122,\"\")","v":""}]
[null,"2.4)",{"$f":"IF('Eingaben (Inputs)'!C123<>\"\",'Eingaben (Inputs)'!C123,\"\")","v":"Segment D"},{"$f":"D87+1","v":4},{"$f":"IF('Eingaben (Inputs)'!E123<>\"\",'Eingaben (Inputs)'!E123,\"\")","v":""}]
[null,null,{"$f":"IF('Eingaben (Inputs)'!C124<>\"\",'Eingaben (Inputs)'!C124,\"\")","v":""},null,{"$f":"IF('Eingaben (Inputs)'!E124<>\"\",'Eingaben (Inputs)'!E124,\"\")","v":""}]
[null,null,{"$f":"IF('Eingaben (Inputs)'!C125<>\"\",'Eingaben (Inputs)'!C125,\"\")","v":"Segmentstruktur"},null,{"$f":"IF('Eingaben (Inputs)'!E125<>\"\",'Eingaben (Inputs)'!E125,\"\")","v":""}]
[null,null,{"$f":"IF('Eingaben (Inputs)'!C126<>\"\",'Eingaben (Inputs)'!C126,\"\")","v":"Anzahl Fahrzeuge"},{"$f":"IF(D123<=$D$12,'Eingaben (Inputs)'!D126,0)","v":0},{"$f":"IF('Eingaben (Inputs)'!E126<>\"\",'Eingaben (Inputs)'!E126,\"\")","v":""}]
[null,null,{"$f":"IF('Eingaben (Inputs)'!C127<>\"\",'Eingaben (Inputs)'!C127,\"\")","v":"Einsatzart"},{"$f":"'Eingaben (Inputs)'!D127","v":"Poolfahrzeuge"},{"$f":"IF('Eingaben (Inputs)'!E127<>\"\",'Eingaben (Inputs)'!E127,\"\")","v":""}]
[null,null,{"$f":"IF('Eingaben (Inputs)'!C128<>\"\",'Eingaben (Inputs)'!C128,\"\")","v":"Einsatzgebiet"},{"$f":"'Eingaben (Inputs)'!D128","v":"regional"},{"$f":"IF('Eingaben (Inputs)'!E128<>\"\",'Eingaben (Inputs)'!E128,\"\")","v":""}]
[null,null,{"$f":"IF('Eingaben (Inputs)'!C129<>\"\",'Eingaben (Inputs)'!C129,\"\")","v":"Heimlademöglichkeit"},{"$f":"INDEX(OFFSET(Heimladen,0,1),_xlfn.XMATCH('Eingaben (Inputs)'!D129,Heimladen))","v":0},{"$f":"IF('Eingaben (Inputs)'!E129<>\"\",'Eingaben (Inputs)'!E129,\"\")","v":""}]
[null,null,{"$f":"IF('Eingaben (Inputs)'!C130<>\"\",'Eingaben (Inputs)'!C130,\"\")","v":""},null,{"$f":"IF('Eingaben (Inputs)'!E130<>\"\",'Eingaben (Inputs)'!E130,\"\")","v":""}]
[null,null,{"$f":"IF('Eingaben (Inputs)'!C131<>\"\",'Eingaben (Inputs)'!C131,\"\")","v":"Fahrzeugdaten"},null,{"$f":"IF('Eingaben (Inputs)'!E131<>\"\",'Eingaben (Inputs)'!E131,\"\")","v":""}]
[null,null,{"$f":"IF('Eingaben (Inputs)'!C132<>\"\",'Eingaben (Inputs)'!C132,\"\")","v":"Fahrzeuggrösse"},{"$f":"'Eingaben (Inputs)'!D132","v":"Mittelklasse"},{"$f":"IF('Eingaben (Inputs)'!E132<>\"\",'Eingaben (Inputs)'!E132,\"\")","v":""}]
[null,null,{"$f":"IF('Eingaben (Inputs)'!C133<>\"\",'Eingaben (Inputs)'!C133,\"\")","v":"Treibstoffverbrauch Verbrenner"},{"$f":"IF('Eingaben (Inputs)'!D133<>\"\",'Eingaben (Inputs)'!D133,'1a. Defaults Segment-Ebene'!D133)","v":5.8},{"$f":"IF('Eingaben (Inputs)'!E133<>\"\",'Eingaben (Inputs)'!E133,\"\")","v":"l/100 km"}]
[null,null,{"$f":"IF('Eingaben (Inputs)'!C134<>\"\",'Eingaben (Inputs)'!C134,\"\")","v":"Energieverbrauch E-Fahrzeug"},{"$f":"IF('Eingaben (Inputs)'!D134<>\"\",'Eingaben (Inputs)'!D134,'1a. Defaults Segment-Ebene'!D134)","v":15.1},{"$f":"IF('Eingaben (Inputs)'!E134<>\"\",'Eingaben (Inputs)'!E134,\"\")","v":"kWh/100 km"}]
[null,null,{"$f":"IF('Eingaben (Inputs)'!C135<>\"\",'Eingaben (Inputs)'!C135,\"\")","v":"Batteriekapazität (netto)"},{"$f":"IF('Eingaben (Inputs)'!D135<>\"\",'Eingaben (Inputs)'!D135,'1a. Defaults Segment-Ebene'!D135)","v":58.625},{"$f":"IF('Eingaben (Inputs)'!E135<>\"\",'Eingaben (Inputs)'!E135,\"\")","v":"kWh"}]
[null,null,{"$f":"IF('Eingaben (Inputs)'!C136<>\"\",'Eingaben (Inputs)'!C136,\"\")","v":""},null,{"$f":"IF('Eingaben (Inputs)'!E136<>\"\",'Eingaben (Inputs)'!E136,\"\")","v":""}]
[null,null,{"$f":"IF('Eingaben (Inputs)'!C137<>\"\",'Eingaben (Inputs)'!C137,\"\")","v":"Fahr- und Nutzungsprofil (Angabe pro Fahrzeug)"},null,{"$f":"IF('Eingaben (Inputs)'!E137<>\"\",'Eingaben (Inputs)'!E137,\"\")","v":""}]
[null,null,{"$f":"IF('Eingaben (Inputs)'!C138<>\"\",'Eingaben (Inputs)'!C138,\"\")","v":"Nutzungsmuster"},{"$f":"'Eingaben (Inputs)'!D138","v":"Werktagsbetrieb"},{"$f":"IF('Eingaben (Inputs)'!E138<>\"\",'Eingaben (Inputs)'!E138,\"\")","v":""}]
[null,null,{"$f":"IF('Eingaben (Inputs)'!C139<>\"\",'Eingaben (Inputs)'!C139,\"\")","v":"Anzahl Arbeitstage pro Jahr"},{"$f":"IF('Eingaben (Inputs)'!D139<>\"\",'Eingaben (Inputs)'!D139,'1a. Defaults Segment-Ebene'!D139)","v":260},{"$f":"IF('Eingaben (Inputs)'!E139<>\"\",'Eingaben (Inputs)'!E139,\"\")","v":""}]
[null,null,{"$f":"IF('Eingaben (Inputs)'!C140<>\"\",'Eingaben (Inputs)'!C140,\"\")","v":"Fahrdistanz während der Arbeitszeit"},{"$f":"IF('Eingaben (Inputs)'!D140<>\"\",'Eingaben (Inputs)'!D140,'1a. Defaults Segment-Ebene'!D140)","v":100},{"$f":"IF('Eingaben (Inputs)'!E140<>\"\",'Eingaben (Inputs)'!E140,\"\")","v":"km/Tag"}]
[null,null,{"$f":"IF('Eingaben (Inputs)'!C141<>\"\",'Eingaben (Inputs)'!C141,\"\")","v":"Pendeldistanz (Hin- und Rückfahrt)"},{"$f":"(_xlfn.XMATCH(D127,Einsatzart)-1)*IF('Eingaben (Inputs)'!D141<>\"\",'Eingaben (Inputs)'!D141,'1a. Defaults Segment-Ebene'!D141)","v":0},{"$f":"IF('Eingaben (Inputs)'!E141<>\"\",'Eingaben (Inputs)'!E141,\"\")","v":"km/Tag"}]
[null,null,{"$f":"IF('Eingaben (Inputs)'!C142<>\"\",'Eingaben (Inputs)'!C142,\"\")","v":"Anzahl Einsätze pro Tag"},{"$f":"IF('Eingaben (Inputs)'!D142<>\"\",'Eingaben (Inputs)'!D142,'1a. Defaults Segment-Ebene'!D142)","v":1},{"$f":"IF('Eingaben (Inputs)'!E142<>\"\",'Eingaben (Inputs)'!E142,\"\")","v":""}]
[null,null,{"$f":"IF('Eingaben (Inputs)'!C143<>\"\",'Eingaben (Inputs)'!C143,\"\")","v":"Anzahl Pausen pro Tag"},{"$f":"'Eingaben (Inputs)'!D143","v":1},{"$f":"IF('Eingaben (Inputs)'!E143<>\"\",'Eingaben (Inputs)'!E143,\"\")","v":""}]
[null,null,{"$f":"IF('Eingaben (Inputs)'!C144<>\"\",'Eingaben (Inputs)'!C144,\"\")","v":"Standzeit pro Pause am Firmenstandort"},{"$f":"IF('Eingaben (Inputs)'!D144<>\"\",'Eingaben (Inputs)'!D144,'1a. Defaults Segment-Ebene'!D144)","v":1},{"$f":"IF('Eingaben (Inputs)'!E144<>\"\",'Eingaben (Inputs)'!E144,\"\")","v":"Stunden"}]
[null,null,{"$f":"IF('Eingaben (Inputs)'!C145<>\"\",'Eingaben (Inputs)'!C145,\"\")","v":"Standzeit über Nacht"},{"$f":"IF('Eingaben (Inputs)'!D145<>\"\",'Eingaben (Inputs)'!D145,'1a. Defaults Segment-Ebene'!D145)*IF(AND(_xlfn.XMATCH(D127,Einsatzart)=2,NOT(D129)),0,1)","v":8},{"$f":"IF('Eingaben (Inputs)'!E145<>\"\",'Eingaben (Inputs)'!E145,\"\")","v":"Stunden"}]
[null,null,{"$f":"IF('Eingaben (Inputs)'!C146<>\"\",'Eingaben (Inputs)'!C146,\"\")","v":"Fahrzeuge pro Ladepunkt, Firmenstandort (tagsüber)"},{"$f":"IF('Eingaben (Inputs)'!D146<>\"\",'Eingaben (Inputs)'!D146,'1a. Defaults Segment-Ebene'!D146)","v":1},{"$f":"IF('Eingaben (Inputs)'!E146<>\"\",'Eingaben (Inputs)'!E146,\"\")","v":""}]
[null,null,{"$f":"IF('Eingaben (Inputs)'!C147<>\"\",'Eingaben (Inputs)'!C147,\"\")","v":""},null,{"$f":"IF('Eingaben (Inputs)'!E147<>\"\",'Eingaben (Inputs)'!E147,\"\")","v":""}]
[null,null,{"$f":"IF('Eingaben (Inputs)'!C148<>\"\",'Eingaben (Inputs)'!C148,\"\")","v":"Kosten (Angabe pro Fahrzeug)"},null,{"$f":"IF('Eingaben (Inputs)'!E148<>\"\",'Eingaben (Inputs)'!E148,\"\")","v":""}]
[null,null,{"$f":"IF('Eingaben (Inputs)'!C149<>\"\",'Eingaben (Inputs)'!C149,\"\")","v":"Laufzeit"},{"$f":"IF('Eingaben (Inputs)'!D149<>\"\",'Eingaben (Inputs)'!D149,'1a. Defaults Segment-Ebene'!D149)","v":48},{"$f":"IF('Eingaben (Inputs)'!E149<>\"\",'Eingaben (Inputs)'!E149,\"\")","v":"Monate"}]
[null,null,{"$f":"IF('Eingaben (Inputs)'!C150<>\"\",'Eingaben (Inputs)'!C150,\"\")","v":"Leasing-Zinssatz"},{"$f":"IF('Eingaben (Inputs)'!D150<>\"\",'Eingaben (Inputs)'!D150,'1a. Defaults Segment-Ebene'!D150)","v":{"v":0.03,"d":"3.0%"}},{"$f":"IF('Eingaben (Inputs)'!E150<>\"\",'Eingaben (Inputs)'!E150,\"\")","v":""}]
[null,null,{"$f":"IF('Eingaben (Inputs)'!C151<>\"\",'Eingaben (Inputs)'!C151,\"\")","v":"Anschaffungspreis inkl. Flottenrabatt Verbrenner"},{"$f":"IF('Eingaben (Inputs)'!D151<>\"\",'Eingaben (Inputs)'!D151,'1a. Defaults Segment-Ebene'!D151)","v":{"v":27219.464999999997,"d":"27,219"}},{"$f":"IF('Eingaben (Inputs)'!E151<>\"\",'Eingaben (Inputs)'!E151,\"\")","v":"CHF"}]
[null,null,{"$f":"IF('Eingaben (Inputs)'!C152<>\"\",'Eingaben (Inputs)'!C152,\"\")","v":"Service- und Reparaturkosten Verbrenner"},{"$f":"IF('Eingaben (Inputs)'!D152<>\"\",'Eingaben (Inputs)'!D152,'1a. Defaults Segment-Ebene'!D152)","v":0.05},{"$f":"IF('Eingaben (Inputs)'!E152<>\"\",'Eingaben (Inputs)'!E152,\"\")","v":"CHF/km"}]
[null,null,{"$f":"IF('Eingaben (Inputs)'!C153<>\"\",'Eingaben (Inputs)'!C153,\"\")","v":"Restwert Verbrenner"},{"$f":"IF('Eingaben (Inputs)'!D153<>\"\",'Eingaben (Inputs)'!D153,'1a. Defaults Segment-Ebene'!D153)","v":{"v":0.31606388888888887,"d":"32%"}},{"$f":"IF('Eingaben (Inputs)'!E153<>\"\",'Eingaben (Inputs)'!E153,\"\")","v":""}]
[null,null,{"$f":"IF('Eingaben (Inputs)'!C154<>\"\",'Eingaben (Inputs)'!C154,\"\")","v":"Anschaffungspreis inkl. Flottenrabatt E-Fahrzeug"},{"$f":"IF('Eingaben (Inputs)'!D154<>\"\",'Eingaben (Inputs)'!D154,'1a. Defaults Segment-Ebene'!D154)","v":{"v":28810.890000000003,"d":"28,811"}},{"$f":"IF('Eingaben (Inputs)'!E154<>\"\",'Eingaben (Inputs)'!E154,\"\")","v":"CHF"}]
[null,null,{"$f":"IF('Eingaben (Inputs)'!C155<>\"\",'Eingaben (Inputs)'!C155,\"\")","v":"Service- und Reparaturkosten E-Fahrzeug"},{"$f":"IF('Eingaben (Inputs)'!D155<>\"\",'Eingaben (Inputs)'!D155,'1a. Defaults Segment-Ebene'!D155)","v":0.025},{"$f":"IF('Eingaben (Inputs)'!E155<>\"\",'Eingaben (Inputs)'!E155,\"\")","v":"CHF/km"}]
[null,null,{"$f":"IF('Eingaben (Inputs)'!C156<>\"\",'Eingaben (Inputs)'!C156,\"\")","v":"Restwert E-Fahrzeug"},{"$f":"IF('Eingaben (Inputs)'!D156<>\"\",'Eingaben (Inputs)'!D156,'1a. Defaults Segment-Ebene'!D156)","v":{"v":0.30658197222222217,"d":"31%"}},{"$f":"IF('Eingaben (Inputs)'!E156<>\"\",'Eingaben (Inputs)'!E156,\"\")","v":""}]
[null,null,{"$f":"IF('Eingaben (Inputs)'!C157<>\"\",'Eingaben (Inputs)'!C157,\"\")","v":""},null,{"$f":"IF('Eingaben (Inputs)'!E157<>\"\",'Eingaben (Inputs)'!E157,\"\")","v":""}]
[null,null,{"$f":"IF('Eingaben (Inputs)'!C158<>\"\",'Eingaben (Inputs)'!C158,\"\")","v":""},null,{"$f":"IF('Eingaben (Inputs)'!E158<>\"\",'Eingaben (Inputs)'!E158,\"\")","v":""}]
[null,"2.5)",{"$f":"IF('Eingaben (Inputs)'!C159<>\"\",'Eingaben (Inputs)'!C159,\"\")","v":"Segment E"},{"$f":"D123+1","v":5},{"$f":"IF('Eingaben (Inputs)'!E159<>\"\",'Eingaben (Inputs)'!E159,\"\")","v":""}]
[null,null,{"$f":"IF('Eingaben (Inputs)'!C160<>\"\",'Eingaben (Inputs)'!C160,\"\")","v":""},null,{"$f":"IF('Eingaben (Inputs)'!E160<>\"\",'Eingaben (Inputs)'!E160,\"\")","v":""}]
[null,null,{"$f":"IF('Eingaben (Inputs)'!C161<>\"\",'Eingaben (Inputs)'!C161,\"\")","v":"Segmentstruktur"},null,{"$f":"IF('Eingaben (Inputs)'!E161<>\"\",'Eingaben (Inputs)'!E161,\"\")","v":""}]
[null,null,{"$f":"IF('Eingaben (Inputs)'!C162<>\"\",'Eingaben (Inputs)'!C162,\"\")","v":"Anzahl Fahrzeuge"},{"$f":"IF(D159<=$D$12,'Eingaben (Inputs)'!D162,0)","v":0},{"$f":"IF('Eingaben (Inputs)'!E162<>\"\",'Eingaben (Inputs)'!E162,\"\")","v":""}]
[null,null,{"$f":"IF('Eingaben (Inputs)'!C163<>\"\",'Eingaben (Inputs)'!C163,\"\")","v":"Einsatzart"},{"$f":"'Eingaben (Inputs)'!D163","v":"Poolfahrzeuge"},{"$f":"IF('Eingaben (Inputs)'!E163<>\"\",'Eingaben (Inputs)'!E163,\"\")","v":""}]
[null,null,{"$f":"IF('Eingaben (Inputs)'!C164<>\"\",'Eingaben (Inputs)'!C164,\"\")","v":"Einsatzgebiet"},{"$f":"'Eingaben (Inputs)'!D164","v":"regional"},{"$f":"IF('Eingaben (Inputs)'!E164<>\"\",'Eingaben (Inputs)'!E164,\"\")","v":""}]
[null,null,{"$f":"IF('Eingaben (Inputs)'!C165<>\"\",'Eingaben (Inputs)'!C165,\"\")","v":"Heimlademöglichkeit"},{"$f":"INDEX(OFFSET(Heimladen,0,1),_xlfn.XMATCH('Eingaben (Inputs)'!D165,Heimladen))","v":0},{"$f":"IF('Eingaben (Inputs)'!E165<>\"\",'Eingaben (Inputs)'!E165,\"\")","v":""}]
[null,null,{"$f":"IF('Eingaben (Inputs)'!C166<>\"\",'Eingaben (Inputs)'!C166,\"\")","v":""},null,{"$f":"IF('Eingaben (Inputs)'!E166<>\"\",'Eingaben (Inputs)'!E166,\"\")","v":""}]
[null,null,{"$f":"IF('Eingaben (Inputs)'!C167<>\"\",'Eingaben (Inputs)'!C167,\"\")","v":"Fahrzeugdaten"},null,{"$f":"IF('Eingaben (Inputs)'!E167<>\"\",'Eingaben (Inputs)'!E167,\"\")","v":""}]
[null,null,{"$f":"IF('Eingaben (Inputs)'!C168<>\"\",'Eingaben (Inputs)'!C168,\"\")","v":"Fahrzeuggrösse"},{"$f":"'Eingaben (Inputs)'!D168","v":"Mittelklasse"},{"$f":"IF('Eingaben (Inputs)'!E168<>\"\",'Eingaben (Inputs)'!E168,\"\")","v":""}]
[null,null,{"$f":"IF('Eingaben (Inputs)'!C169<>\"\",'Eingaben (Inputs)'!C169,\"\")","v":"Treibstoffverbrauch Verbrenner"},{"$f":"IF('Eingaben (Inputs)'!D169<>\"\",'Eingaben (Inputs)'!D169,'1a. Defaults Segment-Ebene'!D169)","v":5.8},{"$f":"IF('Eingaben (Inputs)'!E169<>\"\",'Eingaben (Inputs)'!E169,\"\")","v":"l/100 km"}]
[null,null,{"$f":"IF('Eingaben (Inputs)'!C170<>\"\",'Eingaben (Inputs)'!C170,\"\")","v":"Energieverbrauch E-Fahrzeug"},{"$f":"IF('Eingaben (Inputs)'!D170<>\"\",'Eingaben (Inputs)'!D170,'1a. Defaults Segment-Ebene'!D170)","v":15.1},{"$f":"IF('Eingaben (Inputs)'!E170<>\"\",'Eingaben (Inputs)'!E170,\"\")","v":"kWh/100 km"}]
[null,null,{"$f":"IF('Eingaben (Inputs)'!C171<>\"\",'Eingaben (Inputs)'!C171,\"\")","v":"Batteriekapazität (netto)"},{"$f":"IF('Eingaben (Inputs)'!D171<>\"\",'Eingaben (Inputs)'!D171,'1a. Defaults Segment-Ebene'!D171)","v":58.625},{"$f":"IF('Eingaben (Inputs)'!E171<>\"\",'Eingaben (Inputs)'!E171,\"\")","v":"kWh"}]
[null,null,{"$f":"IF('Eingaben (Inputs)'!C172<>\"\",'Eingaben (Inputs)'!C172,\"\")","v":""},null,{"$f":"IF('Eingaben (Inputs)'!E172<>\"\",'Eingaben (Inputs)'!E172,\"\")","v":""}]
[null,null,{"$f":"IF('Eingaben (Inputs)'!C173<>\"\",'Eingaben (Inputs)'!C173,\"\")","v":"Fahr- und Nutzungsprofil (Angabe pro Fahrzeug)"},null,{"$f":"IF('Eingaben (Inputs)'!E173<>\"\",'Eingaben (Inputs)'!E173,\"\")","v":""}]
[null,null,{"$f":"IF('Eingaben (Inputs)'!C174<>\"\",'Eingaben (Inputs)'!C174,\"\")","v":"Nutzungsmuster"},{"$f":"'Eingaben (Inputs)'!D174","v":"Werktagsbetrieb"},{"$f":"IF('Eingaben (Inputs)'!E174<>\"\",'Eingaben (Inputs)'!E174,\"\")","v":""}]
[null,null,{"$f":"IF('Eingaben (Inputs)'!C175<>\"\",'Eingaben (Inputs)'!C175,\"\")","v":"Anzahl Arbeitstage pro Jahr"},{"$f":"IF('Eingaben (Inputs)'!D175<>\"\",'Eingaben (Inputs)'!D175,'1a. Defaults Segment-Ebene'!D175)","v":260},{"$f":"IF('Eingaben (Inputs)'!E175<>\"\",'Eingaben (Inputs)'!E175,\"\")","v":""}]
[null,null,{"$f":"IF('Eingaben (Inputs)'!C176<>\"\",'Eingaben (Inputs)'!C176,\"\")","v":"Fahrdistanz während der Arbeitszeit"},{"$f":"IF('Eingaben (Inputs)'!D176<>\"\",'Eingaben (Inputs)'!D176,'1a. Defaults Segment-Ebene'!D176)","v":100},{"$f":"IF('Eingaben (Inputs)'!E176<>\"\",'Eingaben (Inputs)'!E176,\"\")","v":"km/Tag"}]
[null,null,{"$f":"IF('Eingaben (Inputs)'!C177<>\"\",'Eingaben (Inputs)'!C177,\"\")","v":"Pendeldistanz (Hin- und Rückfahrt)"},{"$f":"(_xlfn.XMATCH(D163,Einsatzart)-1)*IF('Eingaben (Inputs)'!D177<>\"\",'Eingaben (Inputs)'!D177,'1a. Defaults Segment-Ebene'!D177)","v":0},{"$f":"IF('Eingaben (Inputs)'!E177<>\"\",'Eingaben (Inputs)'!E177,\"\")","v":"km/Tag"}]
[null,null,{"$f":"IF('Eingaben (Inputs)'!C178<>\"\",'Eingaben (Inputs)'!C178,\"\")","v":"Anzahl Einsätze pro Tag"},{"$f":"IF('Eingaben (Inputs)'!D178<>\"\",'Eingaben (Inputs)'!D178,'1a. Defaults Segment-Ebene'!D178)","v":1},{"$f":"IF('Eingaben (Inputs)'!E178<>\"\",'Eingaben (Inputs)'!E178,\"\")","v":""}]
[null,null,{"$f":"IF('Eingaben (Inputs)'!C179<>\"\",'Eingaben (Inputs)'!C179,\"\")","v":"Anzahl Pausen pro Tag"},{"$f":"'Eingaben (Inputs)'!D179","v":1},{"$f":"IF('Eingaben (Inputs)'!E179<>\"\",'Eingaben (Inputs)'!E179,\"\")","v":""}]
[null,null,{"$f":"IF('Eingaben (Inputs)'!C180<>\"\",'Eingaben (Inputs)'!C180,\"\")","v":"Standzeit pro Pause am Firmenstandort"},{"$f":"IF('Eingaben (Inputs)'!D180<>\"\",'Eingaben (Inputs)'!D180,'1a. Defaults Segment-Ebene'!D180)","v":1},{"$f":"IF('Eingaben (Inputs)'!E180<>\"\",'Eingaben (Inputs)'!E180,\"\")","v":"Stunden"}]
[null,null,{"$f":"IF('Eingaben (Inputs)'!C181<>\"\",'Eingaben (Inputs)'!C181,\"\")","v":"Standzeit über Nacht"},{"$f":"IF('Eingaben (Inputs)'!D181<>\"\",'Eingaben (Inputs)'!D181,'1a. Defaults Segment-Ebene'!D181)*IF(AND(_xlfn.XMATCH(D163,Einsatzart)=2,NOT(D165)),0,1)","v":8},{"$f":"IF('Eingaben (Inputs)'!E181<>\"\",'Eingaben (Inputs)'!E181,\"\")","v":"Stunden"}]
[null,null,{"$f":"IF('Eingaben (Inputs)'!C182<>\"\",'Eingaben (Inputs)'!C182,\"\")","v":"Fahrzeuge pro Ladepunkt, Firmenstandort (tagsüber)"},{"$f":"IF('Eingaben (Inputs)'!D182<>\"\",'Eingaben (Inputs)'!D182,'1a. Defaults Segment-Ebene'!D182)","v":1},{"$f":"IF('Eingaben (Inputs)'!E182<>\"\",'Eingaben (Inputs)'!E182,\"\")","v":""}]
[null,null,{"$f":"IF('Eingaben (Inputs)'!C183<>\"\",'Eingaben (Inputs)'!C183,\"\")","v":""},null,{"$f":"IF('Eingaben (Inputs)'!E183<>\"\",'Eingaben (Inputs)'!E183,\"\")","v":""}]
[null,null,{"$f":"IF('Eingaben (Inputs)'!C184<>\"\",'Eingaben (Inputs)'!C184,\"\")","v":"Kosten (Angabe pro Fahrzeug)"},null,{"$f":"IF('Eingaben (Inputs)'!E184<>\"\",'Eingaben (Inputs)'!E184,\"\")","v":""}]
[null,null,{"$f":"IF('Eingaben (Inputs)'!C185<>\"\",'Eingaben (Inputs)'!C185,\"\")","v":"Laufzeit"},{"$f":"IF('Eingaben (Inputs)'!D185<>\"\",'Eingaben (Inputs)'!D185,'1a. Defaults Segment-Ebene'!D185)","v":48},{"$f":"IF('Eingaben (Inputs)'!E185<>\"\",'Eingaben (Inputs)'!E185,\"\")","v":"Monate"}]
[null,null,{"$f":"IF('Eingaben (Inputs)'!C186<>\"\",'Eingaben (Inputs)'!C186,\"\")","v":"Leasing-Zinssatz"},{"$f":"IF('Eingaben (Inputs)'!D186<>\"\",'Eingaben (Inputs)'!D186,'1a. Defaults Segment-Ebene'!D186)","v":{"v":0.03,"d":"3.0%"}},{"$f":"IF('Eingaben (Inputs)'!E186<>\"\",'Eingaben (Inputs)'!E186,\"\")","v":""}]
[null,null,{"$f":"IF('Eingaben (Inputs)'!C187<>\"\",'Eingaben (Inputs)'!C187,\"\")","v":"Anschaffungspreis inkl. Flottenrabatt Verbrenner"},{"$f":"IF('Eingaben (Inputs)'!D187<>\"\",'Eingaben (Inputs)'!D187,'1a. Defaults Segment-Ebene'!D187)","v":{"v":27219.464999999997,"d":"27,219"}},{"$f":"IF('Eingaben (Inputs)'!E187<>\"\",'Eingaben (Inputs)'!E187,\"\")","v":"CHF"}]
[null,null,{"$f":"IF('Eingaben (Inputs)'!C188<>\"\",'Eingaben (Inputs)'!C188,\"\")","v":"Service- und Reparaturkosten Verbrenner"},{"$f":"IF('Eingaben (Inputs)'!D188<>\"\",'Eingaben (Inputs)'!D188,'1a. Defaults Segment-Ebene'!D188)","v":0.05},{"$f":"IF('Eingaben (Inputs)'!E188<>\"\",'Eingaben (Inputs)'!E188,\"\")","v":"CHF/km"}]
[null,null,{"$f":"IF('Eingaben (Inputs)'!C189<>\"\",'Eingaben (Inputs)'!C189,\"\")","v":"Restwert Verbrenner"},{"$f":"IF('Eingaben (Inputs)'!D189<>\"\",'Eingaben (Inputs)'!D189,'1a. Defaults Segment-Ebene'!D189)","v":{"v":0.31606388888888887,"d":"32%"}},{"$f":"IF('Eingaben (Inputs)'!E189<>\"\",'Eingaben (Inputs)'!E189,\"\")","v":""}]
[null,null,{"$f":"IF('Eingaben (Inputs)'!C190<>\"\",'Eingaben (Inputs)'!C190,\"\")","v":"Anschaffungspreis inkl. Flottenrabatt E-Fahrzeug"},{"$f":"IF('Eingaben (Inputs)'!D190<>\"\",'Eingaben (Inputs)'!D190,'1a. Defaults Segment-Ebene'!D190)","v":{"v":28810.890000000003,"d":"28,811"}},{"$f":"IF('Eingaben (Inputs)'!E190<>\"\",'Eingaben (Inputs)'!E190,\"\")","v":"CHF"}]
[null,null,{"$f":"IF('Eingaben (Inputs)'!C191<>\"\",'Eingaben (Inputs)'!C191,\"\")","v":"Service- und Reparaturkosten E-Fahrzeug"},{"$f":"IF('Eingaben (Inputs)'!D191<>\"\",'Eingaben (Inputs)'!D191,'1a. Defaults Segment-Ebene'!D191)","v":0.025},{"$f":"IF('Eingaben (Inputs)'!E191<>\"\",'Eingaben (Inputs)'!E191,\"\")","v":"CHF/km"}]
[null,null,{"$f":"IF('Eingaben (Inputs)'!C192<>\"\",'Eingaben (Inputs)'!C192,\"\")","v":"Restwert E-Fahrzeug"},{"$f":"IF('Eingaben (Inputs)'!D192<>\"\",'Eingaben (Inputs)'!D192,'1a. Defaults Segment-Ebene'!D192)","v":{"v":0.30658197222222217,"d":"31%"}},{"$f":"IF('Eingaben (Inputs)'!E192<>\"\",'Eingaben (Inputs)'!E192,\"\")","v":""}]
[null,null,{"$f":"IF('Eingaben (Inputs)'!C193<>\"\",'Eingaben (Inputs)'!C193,\"\")","v":""},null,{"$f":"IF('Eingaben (Inputs)'!E193<>\"\",'Eingaben (Inputs)'!E193,\"\")","v":""}]
[null,null,{"$f":"IF('Eingaben (Inputs)'!C194<>\"\",'Eingaben (Inputs)'!C194,\"\")","v":""},null,{"$f":"IF('Eingaben (Inputs)'!E194<>\"\",'Eingaben (Inputs)'!E194,\"\")","v":""}]
[null,"2.6)",{"$f":"IF('Eingaben (Inputs)'!C195<>\"\",'Eingaben (Inputs)'!C195,\"\")","v":"Segment F"},{"$f":"D159+1","v":6},{"$f":"IF('Eingaben (Inputs)'!E195<>\"\",'Eingaben (Inputs)'!E195,\"\")","v":""}]
[null,null,{"$f":"IF('Eingaben (Inputs)'!C196<>\"\",'Eingaben (Inputs)'!C196,\"\")","v":""},null,{"$f":"IF('Eingaben (Inputs)'!E196<>\"\",'Eingaben (Inputs)'!E196,\"\")","v":""}]
[null,null,{"$f":"IF('Eingaben (Inputs)'!C197<>\"\",'Eingaben (Inputs)'!C197,\"\")","v":"Segmentstruktur"},null,{"$f":"IF('Eingaben (Inputs)'!E197<>\"\",'Eingaben (Inputs)'!E197,\"\")","v":""}]
[null,null,{"$f":"IF('Eingaben (Inputs)'!C198<>\"\",'Eingaben (Inputs)'!C198,\"\")","v":"Anzahl Fahrzeuge"},{"$f":"IF(D195<=$D$12,'Eingaben (Inputs)'!D198,0)","v":0},{"$f":"IF('Eingaben (Inputs)'!E198<>\"\",'Eingaben (Inputs)'!E198,\"\")","v":""}]
[null,null,{"$f":"IF('Eingaben (Inputs)'!C199<>\"\",'Eingaben (Inputs)'!C199,\"\")","v":"Einsatzart"},{"$f":"'Eingaben (Inputs)'!D199","v":"Poolfahrzeuge"},{"$f":"IF('Eingaben (Inputs)'!E199<>\"\",'Eingaben (Inputs)'!E199,\"\")","v":""}]
[null,null,{"$f":"IF('Eingaben (Inputs)'!C200<>\"\",'Eingaben (Inputs)'!C200,\"\")","v":"Einsatzgebiet"},{"$f":"'Eingaben (Inputs)'!D200","v":"regional"},{"$f":"IF('Eingaben (Inputs)'!E200<>\"\",'Eingaben (Inputs)'!E200,\"\")","v":""}]
[null,null,{"$f":"IF('Eingaben (Inputs)'!C201<>\"\",'Eingaben (Inputs)'!C201,\"\")","v":"Heimlademöglichkeit"},{"$f":"INDEX(OFFSET(Heimladen,0,1),_xlfn.XMATCH('Eingaben (Inputs)'!D201,Heimladen))","v":0},{"$f":"IF('Eingaben (Inputs)'!E201<>\"\",'Eingaben (Inputs)'!E201,\"\")","v":""}]
[null,null,{"$f":"IF('Eingaben (Inputs)'!C202<>\"\",'Eingaben (Inputs)'!C202,\"\")","v":""},null,{"$f":"IF('Eingaben (Inputs)'!E202<>\"\",'Eingaben (Inputs)'!E202,\"\")","v":""}]
[null,null,{"$f":"IF('Eingaben (Inputs)'!C203<>\"\",'Eingaben (Inputs)'!C203,\"\")","v":"Fahrzeugdaten"},null,{"$f":"IF('Eingaben (Inputs)'!E203<>\"\",'Eingaben (Inputs)'!E203,\"\")","v":""}]
[null,null,{"$f":"IF('Eingaben (Inputs)'!C204<>\"\",'Eingaben (Inputs)'!C204,\"\")","v":"Fahrzeuggrösse"},{"$f":"'Eingaben (Inputs)'!D204","v":"Mittelklasse"},{"$f":"IF('Eingaben (Inputs)'!E204<>\"\",'Eingaben (Inputs)'!E204,\"\")","v":""}]
[null,null,{"$f":"IF('Eingaben (Inputs)'!C205<>\"\",'Eingaben (Inputs)'!C205,\"\")","v":"Treibstoffverbrauch Verbrenner"},{"$f":"IF('Eingaben (Inputs)'!D205<>\"\",'Eingaben (Inputs)'!D205,'1a. Defaults Segment-Ebene'!D205)","v":5.8},{"$f":"IF('Eingaben (Inputs)'!E205<>\"\",'Eingaben (Inputs)'!E205,\"\")","v":"l/100 km"}]
[null,null,{"$f":"IF('Eingaben (Inputs)'!C206<>\"\",'Eingaben (Inputs)'!C206,\"\")","v":"Energieverbrauch E-Fahrzeug"},{"$f":"IF('Eingaben (Inputs)'!D206<>\"\",'Eingaben (Inputs)'!D206,'1a. Defaults Segment-Ebene'!D206)","v":15.1},{"$f":"IF('Eingaben (Inputs)'!E206<>\"\",'Eingaben (Inputs)'!E206,\"\")","v":"kWh/100 km"}]
[null,null,{"$f":"IF('Eingaben (Inputs)'!C207<>\"\",'Eingaben (Inputs)'!C207,\"\")","v":"Batteriekapazität (netto)"},{"$f":"IF('Eingaben (Inputs)'!D207<>\"\",'Eingaben (Inputs)'!D207,'1a. Defaults Segment-Ebene'!D207)","v":58.625},{"$f":"IF('Eingaben (Inputs)'!E207<>\"\",'Eingaben (Inputs)'!E207,\"\")","v":"kWh"}]
[null,null,{"$f":"IF('Eingaben (Inputs)'!C208<>\"\",'Eingaben (Inputs)'!C208,\"\")","v":""},null,{"$f":"IF('Eingaben (Inputs)'!E208<>\"\",'Eingaben (Inputs)'!E208,\"\")","v":""}]
[null,null,{"$f":"IF('Eingaben (Inputs)'!C209<>\"\",'Eingaben (Inputs)'!C209,\"\")","v":"Fahr- und Nutzungsprofil (Angabe pro Fahrzeug)"},null,{"$f":"IF('Eingaben (Inputs)'!E209<>\"\",'Eingaben (Inputs)'!E209,\"\")","v":""}]
[null,null,{"$f":"IF('Eingaben (Inputs)'!C210<>\"\",'Eingaben (Inputs)'!C210,\"\")","v":"Nutzungsmuster"},{"$f":"'Eingaben (Inputs)'!D210","v":"Werktagsbetrieb"},{"$f":"IF('Eingaben (Inputs)'!E210<>\"\",'Eingaben (Inputs)'!E210,\"\")","v":""}]
[null,null,{"$f":"IF('Eingaben (Inputs)'!C211<>\"\",'Eingaben (Inputs)'!C211,\"\")","v":"Anzahl Arbeitstage pro Jahr"},{"$f":"IF('Eingaben (Inputs)'!D211<>\"\",'Eingaben (Inputs)'!D211,'1a. Defaults Segment-Ebene'!D211)","v":260},{"$f":"IF('Eingaben (Inputs)'!E211<>\"\",'Eingaben (Inputs)'!E211,\"\")","v":""}]
[null,null,{"$f":"IF('Eingaben (Inputs)'!C212<>\"\",'Eingaben (Inputs)'!C212,\"\")","v":"Fahrdistanz während der Arbeitszeit"},{"$f":"IF('Eingaben (Inputs)'!D212<>\"\",'Eingaben (Inputs)'!D212,'1a. Defaults Segment-Ebene'!D212)","v":100},{"$f":"IF('Eingaben (Inputs)'!E212<>\"\",'Eingaben (Inputs)'!E212,\"\")","v":"km/Tag"}]
[null,null,{"$f":"IF('Eingaben (Inputs)'!C213<>\"\",'Eingaben (Inputs)'!C213,\"\")","v":"Pendeldistanz (Hin- und Rückfahrt)"},{"$f":"(_xlfn.XMATCH(D199,Einsatzart)-1)*IF('Eingaben (Inputs)'!D213<>\"\",'Eingaben (Inputs)'!D213,'1a. Defaults Segment-Ebene'!D213)","v":0},{"$f":"IF('Eingaben (Inputs)'!E213<>\"\",'Eingaben (Inputs)'!E213,\"\")","v":"km/Tag"}]
[null,null,{"$f":"IF('Eingaben (Inputs)'!C214<>\"\",'Eingaben (Inputs)'!C214,\"\")","v":"Anzahl Einsätze pro Tag"},{"$f":"IF('Eingaben (Inputs)'!D214<>\"\",'Eingaben (Inputs)'!D214,'1a. Defaults Segment-Ebene'!D214)","v":1},{"$f":"IF('Eingaben (Inputs)'!E214<>\"\",'Eingaben (Inputs)'!E214,\"\")","v":""}]
[null,null,{"$f":"IF('Eingaben (Inputs)'!C215<>\"\",'Eingaben (Inputs)'!C215,\"\")","v":"Anzahl Pausen pro Tag"},{"$f":"'Eingaben (Inputs)'!D215","v":1},{"$f":"IF('Eingaben (Inputs)'!E215<>\"\",'Eingaben (Inputs)'!E215,\"\")","v":""}]
[null,null,{"$f":"IF('Eingaben (Inputs)'!C216<>\"\",'Eingaben (Inputs)'!C216,\"\")","v":"Standzeit pro Pause am Firmenstandort"},{"$f":"IF('Eingaben (Inputs)'!D216<>\"\",'Eingaben (Inputs)'!D216,'1a. Defaults Segment-Ebene'!D216)","v":1},{"$f":"IF('Eingaben (Inputs)'!E216<>\"\",'Eingaben (Inputs)'!E216,\"\")","v":"Stunden"}]
[null,null,{"$f":"IF('Eingaben (Inputs)'!C217<>\"\",'Eingaben (Inputs)'!C217,\"\")","v":"Standzeit über Nacht"},{"$f":"IF('Eingaben (Inputs)'!D217<>\"\",'Eingaben (Inputs)'!D217,'1a. Defaults Segment-Ebene'!D217)*IF(AND(_xlfn.XMATCH(D199,Einsatzart)=2,NOT(D201)),0,1)","v":8},{"$f":"IF('Eingaben (Inputs)'!E217<>\"\",'Eingaben (Inputs)'!E217,\"\")","v":"Stunden"}]
[null,null,{"$f":"IF('Eingaben (Inputs)'!C218<>\"\",'Eingaben (Inputs)'!C218,\"\")","v":"Fahrzeuge pro Ladepunkt, Firmenstandort (tagsüber)"},{"$f":"IF('Eingaben (Inputs)'!D218<>\"\",'Eingaben (Inputs)'!D218,'1a. Defaults Segment-Ebene'!D218)","v":1},{"$f":"IF('Eingaben (Inputs)'!E218<>\"\",'Eingaben (Inputs)'!E218,\"\")","v":""}]
[null,null,{"$f":"IF('Eingaben (Inputs)'!C219<>\"\",'Eingaben (Inputs)'!C219,\"\")","v":""},null,{"$f":"IF('Eingaben (Inputs)'!E219<>\"\",'Eingaben (Inputs)'!E219,\"\")","v":""}]
[null,null,{"$f":"IF('Eingaben (Inputs)'!C220<>\"\",'Eingaben (Inputs)'!C220,\"\")","v":"Kosten (Angabe pro Fahrzeug)"},null,{"$f":"IF('Eingaben (Inputs)'!E220<>\"\",'Eingaben (Inputs)'!E220,\"\")","v":""}]
[null,null,{"$f":"IF('Eingaben (Inputs)'!C221<>\"\",'Eingaben (Inputs)'!C221,\"\")","v":"Laufzeit"},{"$f":"IF('Eingaben (Inputs)'!D221<>\"\",'Eingaben (Inputs)'!D221,'1a. Defaults Segment-Ebene'!D221)","v":48},{"$f":"IF('Eingaben (Inputs)'!E221<>\"\",'Eingaben (Inputs)'!E221,\"\")","v":"Monate"}]
[null,null,{"$f":"IF('Eingaben (Inputs)'!C222<>\"\",'Eingaben (Inputs)'!C222,\"\")","v":"Leasing-Zinssatz"},{"$f":"IF('Eingaben (Inputs)'!D222<>\"\",'Eingaben (Inputs)'!D222,'1a. Defaults Segment-Ebene'!D222)","v":{"v":0.03,"d":"3.0%"}},{"$f":"IF('Eingaben (Inputs)'!E222<>\"\",'Eingaben (Inputs)'!E222,\"\")","v":""}]
[null,null,{"$f":"IF('Eingaben (Inputs)'!C223<>\"\",'Eingaben (Inputs)'!C223,\"\")","v":"Anschaffungspreis inkl. Flottenrabatt Verbrenner"},{"$f":"IF('Eingaben (Inputs)'!D223<>\"\",'Eingaben (Inputs)'!D223,'1a. Defaults Segment-Ebene'!D223)","v":{"v":27219.464999999997,"d":"27,219"}},{"$f":"IF('Eingaben (Inputs)'!E223<>\"\",'Eingaben (Inputs)'!E223,\"\")","v":"CHF"}]
[null,null,{"$f":"IF('Eingaben (Inputs)'!C224<>\"\",'Eingaben (Inputs)'!C224,\"\")","v":"Service- und Reparaturkosten Verbrenner"},{"$f":"IF('Eingaben (Inputs)'!D224<>\"\",'Eingaben (Inputs)'!D224,'1a. Defaults Segment-Ebene'!D224)","v":0.05},{"$f":"IF('Eingaben (Inputs)'!E224<>\"\",'Eingaben (Inputs)'!E224,\"\")","v":"CHF/km"}]
[null,null,{"$f":"IF('Eingaben (Inputs)'!C225<>\"\",'Eingaben (Inputs)'!C225,\"\")","v":"Restwert Verbrenner"},{"$f":"IF('Eingaben (Inputs)'!D225<>\"\",'Eingaben (Inputs)'!D225,'1a. Defaults Segment-Ebene'!D225)","v":{"v":0.31606388888888887,"d":"32%"}},{"$f":"IF('Eingaben (Inputs)'!E225<>\"\",'Eingaben (Inputs)'!E225,\"\")","v":""}]
[null,null,{"$f":"IF('Eingaben (Inputs)'!C226<>\"\",'Eingaben (Inputs)'!C226,\"\")","v":"Anschaffungspreis inkl. Flottenrabatt E-Fahrzeug"},{"$f":"IF('Eingaben (Inputs)'!D226<>\"\",'Eingaben (Inputs)'!D226,'1a. Defaults Segment-Ebene'!D226)","v":{"v":28810.890000000003,"d":"28,811"}},{"$f":"IF('Eingaben (Inputs)'!E226<>\"\",'Eingaben (Inputs)'!E226,\"\")","v":"CHF"}]
[null,null,{"$f":"IF('Eingaben (Inputs)'!C227<>\"\",'Eingaben (Inputs)'!C227,\"\")","v":"Service- und Reparaturkosten E-Fahrzeug"},{"$f":"IF('Eingaben (Inputs)'!D227<>\"\",'Eingaben (Inputs)'!D227,'1a. Defaults Segment-Ebene'!D227)","v":0.025},{"$f":"IF('Eingaben (Inputs)'!E227<>\"\",'Eingaben (Inputs)'!E227,\"\")","v":"CHF/km"}]
[null,null,{"$f":"IF('Eingaben (Inputs)'!C228<>\"\",'Eingaben (Inputs)'!C228,\"\")","v":"Restwert E-Fahrzeug"},{"$f":"IF('Eingaben (Inputs)'!D228<>\"\",'Eingaben (Inputs)'!D228,'1a. Defaults Segment-Ebene'!D228)","v":{"v":0.30658197222222217,"d":"31%"}},{"$f":"IF('Eingaben (Inputs)'!E228<>\"\",'Eingaben (Inputs)'!E228,\"\")","v":""}]
[null,null,{"$f":"IF('Eingaben (Inputs)'!C229<>\"\",'Eingaben (Inputs)'!C229,\"\")","v":""},null,{"$f":"IF('Eingaben (Inputs)'!E229<>\"\",'Eingaben (Inputs)'!E229,\"\")","v":""}]
[null,null,{"$f":"IF('Eingaben (Inputs)'!C230<>\"\",'Eingaben (Inputs)'!C230,\"\")","v":""},null,{"$f":"IF('Eingaben (Inputs)'!E230<>\"\",'Eingaben (Inputs)'!E230,\"\")","v":""}]
[null,"2.7)",{"$f":"IF('Eingaben (Inputs)'!C231<>\"\",'Eingaben (Inputs)'!C231,\"\")","v":"Segment G"},{"$f":"D195+1","v":7},{"$f":"IF('Eingaben (Inputs)'!E231<>\"\",'Eingaben (Inputs)'!E231,\"\")","v":""}]
[null,null,{"$f":"IF('Eingaben (Inputs)'!C232<>\"\",'Eingaben (Inputs)'!C232,\"\")","v":""},null,{"$f":"IF('Eingaben (Inputs)'!E232<>\"\",'Eingaben (Inputs)'!E232,\"\")","v":""}]
[null,null,{"$f":"IF('Eingaben (Inputs)'!C233<>\"\",'Eingaben (Inputs)'!C233,\"\")","v":"Segmentstruktur"},null,{"$f":"IF('Eingaben (Inputs)'!E233<>\"\",'Eingaben (Inputs)'!E233,\"\")","v":""}]
[null,null,{"$f":"IF('Eingaben (Inputs)'!C234<>\"\",'Eingaben (Inputs)'!C234,\"\")","v":"Anzahl Fahrzeuge"},{"$f":"IF(D231<=$D$12,'Eingaben (Inputs)'!D234,0)","v":0},{"$f":"IF('Eingaben (Inputs)'!E234<>\"\",'Eingaben (Inputs)'!E234,\"\")","v":""}]
[null,null,{"$f":"IF('Eingaben (Inputs)'!C235<>\"\",'Eingaben (Inputs)'!C235,\"\")","v":"Einsatzart"},{"$f":"'Eingaben (Inputs)'!D235","v":"Poolfahrzeuge"},{"$f":"IF('Eingaben (Inputs)'!E235<>\"\",'Eingaben (Inputs)'!E235,\"\")","v":""}]
[null,null,{"$f":"IF('Eingaben (Inputs)'!C236<>\"\",'Eingaben (Inputs)'!C236,\"\")","v":"Einsatzgebiet"},{"$f":"'Eingaben (Inputs)'!D236","v":"regional"},{"$f":"IF('Eingaben (Inputs)'!E236<>\"\",'Eingaben (Inputs)'!E236,\"\")","v":""}]
[null,null,{"$f":"IF('Eingaben (Inputs)'!C237<>\"\",'Eingaben (Inputs)'!C237,\"\")","v":"Heimlademöglichkeit"},{"$f":"INDEX(OFFSET(Heimladen,0,1),_xlfn.XMATCH('Eingaben (Inputs)'!D237,Heimladen))","v":0},{"$f":"IF('Eingaben (Inputs)'!E237<>\"\",'Eingaben (Inputs)'!E237,\"\")","v":""}]
[null,null,{"$f":"IF('Eingaben (Inputs)'!C238<>\"\",'Eingaben (Inputs)'!C238,\"\")","v":""},null,{"$f":"IF('Eingaben (Inputs)'!E238<>\"\",'Eingaben (Inputs)'!E238,\"\")","v":""}]
[null,null,{"$f":"IF('Eingaben (Inputs)'!C239<>\"\",'Eingaben (Inputs)'!C239,\"\")","v":"Fahrzeugdaten"},null,{"$f":"IF('Eingaben (Inputs)'!E239<>\"\",'Eingaben (Inputs)'!E239,\"\")","v":""}]
[null,null,{"$f":"IF('Eingaben (Inputs)'!C240<>\"\",'Eingaben (Inputs)'!C240,\"\")","v":"Fahrzeuggrösse"},{"$f":"'Eingaben (Inputs)'!D240","v":"Mittelklasse"},{"$f":"IF('Eingaben (Inputs)'!E240<>\"\",'Eingaben (Inputs)'!E240,\"\")","v":""}]
[null,null,{"$f":"IF('Eingaben (Inputs)'!C241<>\"\",'Eingaben (Inputs)'!C241,\"\")","v":"Treibstoffverbrauch Verbrenner"},{"$f":"IF('Eingaben (Inputs)'!D241<>\"\",'Eingaben (Inputs)'!D241,'1a. Defaults Segment-Ebene'!D241)","v":5.8},{"$f":"IF('Eingaben (Inputs)'!E241<>\"\",'Eingaben (Inputs)'!E241,\"\")","v":"l/100 km"}]
[null,null,{"$f":"IF('Eingaben (Inputs)'!C242<>\"\",'Eingaben (Inputs)'!C242,\"\")","v":"Energieverbrauch E-Fahrzeug"},{"$f":"IF('Eingaben (Inputs)'!D242<>\"\",'Eingaben (Inputs)'!D242,'1a. Defaults Segment-Ebene'!D242)","v":15.1},{"$f":"IF('Eingaben (Inputs)'!E242<>\"\",'Eingaben (Inputs)'!E242,\"\")","v":"kWh/100 km"}]
[null,null,{"$f":"IF('Eingaben (Inputs)'!C243<>\"\",'Eingaben (Inputs)'!C243,\"\")","v":"Batteriekapazität (netto)"},{"$f":"IF('Eingaben (Inputs)'!D243<>\"\",'Eingaben (Inputs)'!D243,'1a. Defaults Segment-Ebene'!D243)","v":58.625},{"$f":"IF('Eingaben (Inputs)'!E243<>\"\",'Eingaben (Inputs)'!E243,\"\")","v":"kWh"}]
[null,null,{"$f":"IF('Eingaben (Inputs)'!C244<>\"\",'Eingaben (Inputs)'!C244,\"\")","v":""},null,{"$f":"IF('Eingaben (Inputs)'!E244<>\"\",'Eingaben (Inputs)'!E244,\"\")","v":""}]
[null,null,{"$f":"IF('Eingaben (Inputs)'!C245<>\"\",'Eingaben (Inputs)'!C245,\"\")","v":"Fahr- und Nutzungsprofil (Angabe pro Fahrzeug)"},null,{"$f":"IF('Eingaben (Inputs)'!E245<>\"\",'Eingaben (Inputs)'!E245,\"\")","v":""}]
[null,null,{"$f":"IF('Eingaben (Inputs)'!C246<>\"\",'Eingaben (Inputs)'!C246,\"\")","v":"Nutzungsmuster"},{"$f":"'Eingaben (Inputs)'!D246","v":"Werktagsbetrieb"},{"$f":"IF('Eingaben (Inputs)'!E246<>\"\",'Eingaben (Inputs)'!E246,\"\")","v":""}]
[null,null,{"$f":"IF('Eingaben (Inputs)'!C247<>\"\",'Eingaben (Inputs)'!C247,\"\")","v":"Anzahl Arbeitstage pro Jahr"},{"$f":"IF('Eingaben (Inputs)'!D247<>\"\",'Eingaben (Inputs)'!D247,'1a. Defaults Segment-Ebene'!D247)","v":260},{"$f":"IF('Eingaben (Inputs)'!E247<>\"\",'Eingaben (Inputs)'!E247,\"\")","v":""}]
[null,null,{"$f":"IF('Eingaben (Inputs)'!C248<>\"\",'Eingaben (Inputs)'!C248,\"\")","v":"Fahrdistanz während der Arbeitszeit"},{"$f":"IF('Eingaben (Inputs)'!D248<>\"\",'Eingaben (Inputs)'!D248,'1a. Defaults Segment-Ebene'!D248)","v":100},{"$f":"IF('Eingaben (Inputs)'!E248<>\"\",'Eingaben (Inputs)'!E248,\"\")","v":"km/Tag"}]
[null,null,{"$f":"IF('Eingaben (Inputs)'!C249<>\"\",'Eingaben (Inputs)'!C249,\"\")","v":"Pendeldistanz (Hin- und Rückfahrt)"},{"$f":"(_xlfn.XMATCH(D235,Einsatzart)-1)*IF('Eingaben (Inputs)'!D249<>\"\",'Eingaben (Inputs)'!D249,'1a. Defaults Segment-Ebene'!D249)","v":0},{"$f":"IF('Eingaben (Inputs)'!E249<>\"\",'Eingaben (Inputs)'!E249,\"\")","v":"km/Tag"}]
[null,null,{"$f":"IF('Eingaben (Inputs)'!C250<>\"\",'Eingaben (Inputs)'!C250,\"\")","v":"Anzahl Einsätze pro Tag"},{"$f":"IF('Eingaben (Inputs)'!D250<>\"\",'Eingaben (Inputs)'!D250,'1a. Defaults Segment-Ebene'!D250)","v":1},{"$f":"IF('Eingaben (Inputs)'!E250<>\"\",'Eingaben (Inputs)'!E250,\"\")","v":""}]
[null,null,{"$f":"IF('Eingaben (Inputs)'!C251<>\"\",'Eingaben (Inputs)'!C251,\"\")","v":"Anzahl Pausen pro Tag"},{"$f":"'Eingaben (Inputs)'!D251","v":1},{"$f":"IF('Eingaben (Inputs)'!E251<>\"\",'Eingaben (Inputs)'!E251,\"\")","v":""}]
[null,null,{"$f":"IF('Eingaben (Inputs)'!C252<>\"\",'Eingaben (Inputs)'!C252,\"\")","v":"Standzeit pro Pause am Firmenstandort"},{"$f":"IF('Eingaben (Inputs)'!D252<>\"\",'Eingaben (Inputs)'!D252,'1a. Defaults Segment-Ebene'!D252)","v":1},{"$f":"IF('Eingaben (Inputs)'!E252<>\"\",'Eingaben (Inputs)'!E252,\"\")","v":"Stunden"}]
[null,null,{"$f":"IF('Eingaben (Inputs)'!C253<>\"\",'Eingaben (Inputs)'!C253,\"\")","v":"Standzeit über Nacht"},{"$f":"IF('Eingaben (Inputs)'!D253<>\"\",'Eingaben (Inputs)'!D253,'1a. Defaults Segment-Ebene'!D253)*IF(AND(_xlfn.XMATCH(D235,Einsatzart)=2,NOT(D237)),0,1)","v":8},{"$f":"IF('Eingaben (Inputs)'!E253<>\"\",'Eingaben (Inputs)'!E253,\"\")","v":"Stunden"}]
[null,null,{"$f":"IF('Eingaben (Inputs)'!C254<>\"\",'Eingaben (Inputs)'!C254,\"\")","v":"Fahrzeuge pro Ladepunkt, Firmenstandort (tagsüber)"},{"$f":"IF('Eingaben (Inputs)'!D254<>\"\",'Eingaben (Inputs)'!D254,'1a. Defaults Segment-Ebene'!D254)","v":1},{"$f":"IF('Eingaben (Inputs)'!E254<>\"\",'Eingaben (Inputs)'!E254,\"\")","v":""}]
[null,null,{"$f":"IF('Eingaben (Inputs)'!C255<>\"\",'Eingaben (Inputs)'!C255,\"\")","v":""},null,{"$f":"IF('Eingaben (Inputs)'!E255<>\"\",'Eingaben (Inputs)'!E255,\"\")","v":""}]
[null,null,{"$f":"IF('Eingaben (Inputs)'!C256<>\"\",'Eingaben (Inputs)'!C256,\"\")","v":"Kosten (Angabe pro Fahrzeug)"},null,{"$f":"IF('Eingaben (Inputs)'!E256<>\"\",'Eingaben (Inputs)'!E256,\"\")","v":""}]
[null,null,{"$f":"IF('Eingaben (Inputs)'!C257<>\"\",'Eingaben (Inputs)'!C257,\"\")","v":"Laufzeit"},{"$f":"IF('Eingaben (Inputs)'!D257<>\"\",'Eingaben (Inputs)'!D257,'1a. Defaults Segment-Ebene'!D257)","v":48},{"$f":"IF('Eingaben (Inputs)'!E257<>\"\",'Eingaben (Inputs)'!E257,\"\")","v":"Monate"}]
[null,null,{"$f":"IF('Eingaben (Inputs)'!C258<>\"\",'Eingaben (Inputs)'!C258,\"\")","v":"Leasing-Zinssatz"},{"$f":"IF('Eingaben (Inputs)'!D258<>\"\",'Eingaben (Inputs)'!D258,'1a. Defaults Segment-Ebene'!D258)","v":{"v":0.03,"d":"3.0%"}},{"$f":"IF('Eingaben (Inputs)'!E258<>\"\",'Eingaben (Inputs)'!E258,\"\")","v":""}]
[null,null,{"$f":"IF('Eingaben (Inputs)'!C259<>\"\",'Eingaben (Inputs)'!C259,\"\")","v":"Anschaffungspreis inkl. Flottenrabatt Verbrenner"},{"$f":"IF('Eingaben (Inputs)'!D259<>\"\",'Eingaben (Inputs)'!D259,'1a. Defaults Segment-Ebene'!D259)","v":{"v":27219.464999999997,"d":"27,219"}},{"$f":"IF('Eingaben (Inputs)'!E259<>\"\",'Eingaben (Inputs)'!E259,\"\")","v":"CHF"}]
[null,null,{"$f":"IF('Eingaben (Inputs)'!C260<>\"\",'Eingaben (Inputs)'!C260,\"\")","v":"Service- und Reparaturkosten Verbrenner"},{"$f":"IF('Eingaben (Inputs)'!D260<>\"\",'Eingaben (Inputs)'!D260,'1a. Defaults Segment-Ebene'!D260)","v":0.05},{"$f":"IF('Eingaben (Inputs)'!E260<>\"\",'Eingaben (Inputs)'!E260,\"\")","v":"CHF/km"}]
[null,null,{"$f":"IF('Eingaben (Inputs)'!C261<>\"\",'Eingaben (Inputs)'!C261,\"\")","v":"Restwert Verbrenner"},{"$f":"IF('Eingaben (Inputs)'!D261<>\"\",'Eingaben (Inputs)'!D261,'1a. Defaults Segment-Ebene'!D261)","v":{"v":0.31606388888888887,"d":"32%"}},{"$f":"IF('Eingaben (Inputs)'!E261<>\"\",'Eingaben (Inputs)'!E261,\"\")","v":""}]
[null,null,{"$f":"IF('Eingaben (Inputs)'!C262<>\"\",'Eingaben (Inputs)'!C262,\"\")","v":"Anschaffungspreis inkl. Flottenrabatt E-Fahrzeug"},{"$f":"IF('Eingaben (Inputs)'!D262<>\"\",'Eingaben (Inputs)'!D262,'1a. Defaults Segment-Ebene'!D262)","v":{"v":28810.890000000003,"d":"28,811"}},{"$f":"IF('Eingaben (Inputs)'!E262<>\"\",'Eingaben (Inputs)'!E262,\"\")","v":"CHF"}]
[null,null,{"$f":"IF('Eingaben (Inputs)'!C263<>\"\",'Eingaben (Inputs)'!C263,\"\")","v":"Service- und Reparaturkosten E-Fahrzeug"},{"$f":"IF('Eingaben (Inputs)'!D263<>\"\",'Eingaben (Inputs)'!D263,'1a. Defaults Segment-Ebene'!D263)","v":0.025},{"$f":"IF('Eingaben (Inputs)'!E263<>\"\",'Eingaben (Inputs)'!E263,\"\")","v":"CHF/km"}]
[null,null,{"$f":"IF('Eingaben (Inputs)'!C264<>\"\",'Eingaben (Inputs)'!C264,\"\")","v":"Restwert E-Fahrzeug"},{"$f":"IF('Eingaben (Inputs)'!D264<>\"\",'Eingaben (Inputs)'!D264,'1a. Defaults Segment-Ebene'!D264)","v":{"v":0.30658197222222217,"d":"31%"}},{"$f":"IF('Eingaben (Inputs)'!E264<>\"\",'Eingaben (Inputs)'!E264,\"\")","v":""}]
[null,null,{"$f":"IF('Eingaben (Inputs)'!C265<>\"\",'Eingaben (Inputs)'!C265,\"\")","v":""},null,{"$f":"IF('Eingaben (Inputs)'!E265<>\"\",'Eingaben (Inputs)'!E265,\"\")","v":""}]
[null,null,{"$f":"IF('Eingaben (Inputs)'!C266<>\"\",'Eingaben (Inputs)'!C266,\"\")","v":""},null,{"$f":"IF('Eingaben (Inputs)'!E266<>\"\",'Eingaben (Inputs)'!E266,\"\")","v":""}]
[null,"2.8)",{"$f":"IF('Eingaben (Inputs)'!C267<>\"\",'Eingaben (Inputs)'!C267,\"\")","v":"Segment H"},{"$f":"D231+1","v":8},{"$f":"IF('Eingaben (Inputs)'!E267<>\"\",'Eingaben (Inputs)'!E267,\"\")","v":""}]
[null,null,{"$f":"IF('Eingaben (Inputs)'!C268<>\"\",'Eingaben (Inputs)'!C268,\"\")","v":""},null,{"$f":"IF('Eingaben (Inputs)'!E268<>\"\",'Eingaben (Inputs)'!E268,\"\")","v":""}]
[null,null,{"$f":"IF('Eingaben (Inputs)'!C269<>\"\",'Eingaben (Inputs)'!C269,\"\")","v":"Segmentstruktur"},null,{"$f":"IF('Eingaben (Inputs)'!E269<>\"\",'Eingaben (Inputs)'!E269,\"\")","v":""}]
[null,null,{"$f":"IF('Eingaben (Inputs)'!C270<>\"\",'Eingaben (Inputs)'!C270,\"\")","v":"Anzahl Fahrzeuge"},{"$f":"IF(D267<=$D$12,'Eingaben (Inputs)'!D270,0)","v":0},{"$f":"IF('Eingaben (Inputs)'!E270<>\"\",'Eingaben (Inputs)'!E270,\"\")","v":""}]
[null,null,{"$f":"IF('Eingaben (Inputs)'!C271<>\"\",'Eingaben (Inputs)'!C271,\"\")","v":"Einsatzart"},{"$f":"'Eingaben (Inputs)'!D271","v":"Poolfahrzeuge"},{"$f":"IF('Eingaben (Inputs)'!E271<>\"\",'Eingaben (Inputs)'!E271,\"\")","v":""}]
[null,null,{"$f":"IF('Eingaben (Inputs)'!C272<>\"\",'Eingaben (Inputs)'!C272,\"\")","v":"Einsatzgebiet"},{"$f":"'Eingaben (Inputs)'!D272","v":"regional"},{"$f":"IF('Eingaben (Inputs)'!E272<>\"\",'Eingaben (Inputs)'!E272,\"\")","v":""}]
[null,null,{"$f":"IF('Eingaben (Inputs)'!C273<>\"\",'Eingaben (Inputs)'!C273,\"\")","v":"Heimlademöglichkeit"},{"$f":"INDEX(OFFSET(Heimladen,0,1),_xlfn.XMATCH('Eingaben (Inputs)'!D273,Heimladen))","v":0},{"$f":"IF('Eingaben (Inputs)'!E273<>\"\",'Eingaben (Inputs)'!E273,\"\")","v":""}]
[null,null,{"$f":"IF('Eingaben (Inputs)'!C274<>\"\",'Eingaben (Inputs)'!C274,\"\")","v":""},null,{"$f":"IF('Eingaben (Inputs)'!E274<>\"\",'Eingaben (Inputs)'!E274,\"\")","v":""}]
[null,null,{"$f":"IF('Eingaben (Inputs)'!C275<>\"\",'Eingaben (Inputs)'!C275,\"\")","v":"Fahrzeugdaten"},null,{"$f":"IF('Eingaben (Inputs)'!E275<>\"\",'Eingaben (Inputs)'!E275,\"\")","v":""}]
[null,null,{"$f":"IF('Eingaben (Inputs)'!C276<>\"\",'Eingaben (Inputs)'!C276,\"\")","v":"Fahrzeuggrösse"},{"$f":"'Eingaben (Inputs)'!D276","v":"Mittelklasse"},{"$f":"IF('Eingaben (Inputs)'!E276<>\"\",'Eingaben (Inputs)'!E276,\"\")","v":""}]
[null,null,{"$f":"IF('Eingaben (Inputs)'!C277<>\"\",'Eingaben (Inputs)'!C277,\"\")","v":"Treibstoffverbrauch Verbrenner"},{"$f":"IF('Eingaben (Inputs)'!D277<>\"\",'Eingaben (Inputs)'!D277,'1a. Defaults Segment-Ebene'!D277)","v":5.8},{"$f":"IF('Eingaben (Inputs)'!E277<>\"\",'Eingaben (Inputs)'!E277,\"\")","v":"l/100 km"}]
[null,null,{"$f":"IF('Eingaben (Inputs)'!C278<>\"\",'Eingaben (Inputs)'!C278,\"\")","v":"Energieverbrauch E-Fahrzeug"},{"$f":"IF('Eingaben (Inputs)'!D278<>\"\",'Eingaben (Inputs)'!D278,'1a. Defaults Segment-Ebene'!D278)","v":15.1},{"$f":"IF('Eingaben (Inputs)'!E278<>\"\",'Eingaben (Inputs)'!E278,\"\")","v":"kWh/100 km"}]
[null,null,{"$f":"IF('Eingaben (Inputs)'!C279<>\"\",'Eingaben (Inputs)'!C279,\"\")","v":"Batteriekapazität (netto)"},{"$f":"IF('Eingaben (Inputs)'!D279<>\"\",'Eingaben (Inputs)'!D279,'1a. Defaults Segment-Ebene'!D279)","v":58.625},{"$f":"IF('Eingaben (Inputs)'!E279<>\"\",'Eingaben (Inputs)'!E279,\"\")","v":"kWh"}]
[null,null,{"$f":"IF('Eingaben (Inputs)'!C280<>\"\",'Eingaben (Inputs)'!C280,\"\")","v":""},null,{"$f":"IF('Eingaben (Inputs)'!E280<>\"\",'Eingaben (Inputs)'!E280,\"\")","v":""}]
[null,null,{"$f":"IF('Eingaben (Inputs)'!C281<>\"\",'Eingaben (Inputs)'!C281,\"\")","v":"Fahr- und Nutzungsprofil (Angabe pro Fahrzeug)"},null,{"$f":"IF('Eingaben (Inputs)'!E281<>\"\",'Eingaben (Inputs)'!E281,\"\")","v":""}]
[null,null,{"$f":"IF('Eingaben (Inputs)'!C282<>\"\",'Eingaben (Inputs)'!C282,\"\")","v":"Nutzungsmuster"},{"$f":"'Eingaben (Inputs)'!D282","v":"Werktagsbetrieb"},{"$f":"IF('Eingaben (Inputs)'!E282<>\"\",'Eingaben (Inputs)'!E282,\"\")","v":""}]
[null,null,{"$f":"IF('Eingaben (Inputs)'!C283<>\"\",'Eingaben (Inputs)'!C283,\"\")","v":"Anzahl Arbeitstage pro Jahr"},{"$f":"IF('Eingaben (Inputs)'!D283<>\"\",'Eingaben (Inputs)'!D283,'1a. Defaults Segment-Ebene'!D283)","v":260},{"$f":"IF('Eingaben (Inputs)'!E283<>\"\",'Eingaben (Inputs)'!E283,\"\")","v":""}]
[null,null,{"$f":"IF('Eingaben (Inputs)'!C284<>\"\",'Eingaben (Inputs)'!C284,\"\")","v":"Fahrdistanz während der Arbeitszeit"},{"$f":"IF('Eingaben (Inputs)'!D284<>\"\",'Eingaben (Inputs)'!D284,'1a. Defaults Segment-Ebene'!D284)","v":100},{"$f":"IF('Eingaben (Inputs)'!E284<>\"\",'Eingaben (Inputs)'!E284,\"\")","v":"km/Tag"}]
[null,null,{"$f":"IF('Eingaben (Inputs)'!C285<>\"\",'Eingaben (Inputs)'!C285,\"\")","v":"Pendeldistanz (Hin- und Rückfahrt)"},{"$f":"(_xlfn.XMATCH(D271,Einsatzart)-1)*IF('Eingaben (Inputs)'!D285<>\"\",'Eingaben (Inputs)'!D285,'1a. Defaults Segment-Ebene'!D285)","v":0},{"$f":"IF('Eingaben (Inputs)'!E285<>\"\",'Eingaben (Inputs)'!E285,\"\")","v":"km/Tag"}]
[null,null,{"$f":"IF('Eingaben (Inputs)'!C286<>\"\",'Eingaben (Inputs)'!C286,\"\")","v":"Anzahl Einsätze pro Tag"},{"$f":"IF('Eingaben (Inputs)'!D286<>\"\",'Eingaben (Inputs)'!D286,'1a. Defaults Segment-Ebene'!D286)","v":1},{"$f":"IF('Eingaben (Inputs)'!E286<>\"\",'Eingaben (Inputs)'!E286,\"\")","v":""}]
[null,null,{"$f":"IF('Eingaben (Inputs)'!C287<>\"\",'Eingaben (Inputs)'!C287,\"\")","v":"Anzahl Pausen pro Tag"},{"$f":"'Eingaben (Inputs)'!D287","v":1},{"$f":"IF('Eingaben (Inputs)'!E287<>\"\",'Eingaben (Inputs)'!E287,\"\")","v":""}]
[null,null,{"$f":"IF('Eingaben (Inputs)'!C288<>\"\",'Eingaben (Inputs)'!C288,\"\")","v":"Standzeit pro Pause am Firmenstandort"},{"$f":"IF('Eingaben (Inputs)'!D288<>\"\",'Eingaben (Inputs)'!D288,'1a. Defaults Segment-Ebene'!D288)","v":1},{"$f":"IF('Eingaben (Inputs)'!E288<>\"\",'Eingaben (Inputs)'!E288,\"\")","v":"Stunden"}]
[null,null,{"$f":"IF('Eingaben (Inputs)'!C289<>\"\",'Eingaben (Inputs)'!C289,\"\")","v":"Standzeit über Nacht"},{"$f":"IF('Eingaben (Inputs)'!D289<>\"\",'Eingaben (Inputs)'!D289,'1a. Defaults Segment-Ebene'!D289)*IF(AND(_xlfn.XMATCH(D271,Einsatzart)=2,NOT(D273)),0,1)","v":8},{"$f":"IF('Eingaben (Inputs)'!E289<>\"\",'Eingaben (Inputs)'!E289,\"\")","v":"Stunden"}]
[null,null,{"$f":"IF('Eingaben (Inputs)'!C290<>\"\",'Eingaben (Inputs)'!C290,\"\")","v":"Fahrzeuge pro Ladepunkt, Firmenstandort (tagsüber)"},{"$f":"IF('Eingaben (Inputs)'!D290<>\"\",'Eingaben (Inputs)'!D290,'1a. Defaults Segment-Ebene'!D290)","v":1},{"$f":"IF('Eingaben (Inputs)'!E290<>\"\",'Eingaben (Inputs)'!E290,\"\")","v":""}]
[null,null,{"$f":"IF('Eingaben (Inputs)'!C291<>\"\",'Eingaben (Inputs)'!C291,\"\")","v":""},null,{"$f":"IF('Eingaben (Inputs)'!E291<>\"\",'Eingaben (Inputs)'!E291,\"\")","v":""}]
[null,null,{"$f":"IF('Eingaben (Inputs)'!C292<>\"\",'Eingaben (Inputs)'!C292,\"\")","v":"Kosten (Angabe pro Fahrzeug)"},null,{"$f":"IF('Eingaben (Inputs)'!E292<>\"\",'Eingaben (Inputs)'!E292,\"\")","v":""}]
[null,null,{"$f":"IF('Eingaben (Inputs)'!C293<>\"\",'Eingaben (Inputs)'!C293,\"\")","v":"Laufzeit"},{"$f":"IF('Eingaben (Inputs)'!D293<>\"\",'Eingaben (Inputs)'!D293,'1a. Defaults Segment-Ebene'!D293)","v":48},{"$f":"IF('Eingaben (Inputs)'!E293<>\"\",'Eingaben (Inputs)'!E293,\"\")","v":"Monate"}]
[null,null,{"$f":"IF('Eingaben (Inputs)'!C294<>\"\",'Eingaben (Inputs)'!C294,\"\")","v":"Leasing-Zinssatz"},{"$f":"IF('Eingaben (Inputs)'!D294<>\"\",'Eingaben (Inputs)'!D294,'1a. Defaults Segment-Ebene'!D294)","v":{"v":0.03,"d":"3.0%"}},{"$f":"IF('Eingaben (Inputs)'!E294<>\"\",'Eingaben (Inputs)'!E294,\"\")","v":""}]
[null,null,{"$f":"IF('Eingaben (Inputs)'!C295<>\"\",'Eingaben (Inputs)'!C295,\"\")","v":"Anschaffungspreis inkl. Flottenrabatt Verbrenner"},{"$f":"IF('Eingaben (Inputs)'!D295<>\"\",'Eingaben (Inputs)'!D295,'1a. Defaults Segment-Ebene'!D295)","v":{"v":27219.464999999997,"d":"27,219"}},{"$f":"IF('Eingaben (Inputs)'!E295<>\"\",'Eingaben (Inputs)'!E295,\"\")","v":"CHF"}]
[null,null,{"$f":"IF('Eingaben (Inputs)'!C296<>\"\",'Eingaben (Inputs)'!C296,\"\")","v":"Service- und Reparaturkosten Verbrenner"},{"$f":"IF('Eingaben (Inputs)'!D296<>\"\",'Eingaben (Inputs)'!D296,'1a. Defaults Segment-Ebene'!D296)","v":0.05},{"$f":"IF('Eingaben (Inputs)'!E296<>\"\",'Eingaben (Inputs)'!E296,\"\")","v":"CHF/km"}]
[null,null,{"$f":"IF('Eingaben (Inputs)'!C297<>\"\",'Eingaben (Inputs)'!C297,\"\")","v":"Restwert Verbrenner"},{"$f":"IF('Eingaben (Inputs)'!D297<>\"\",'Eingaben (Inputs)'!D297,'1a. Defaults Segment-Ebene'!D297)","v":{"v":0.31606388888888887,"d":"32%"}},{"$f":"IF('Eingaben (Inputs)'!E297<>\"\",'Eingaben (Inputs)'!E297,\"\")","v":""}]
[null,null,{"$f":"IF('Eingaben (Inputs)'!C298<>\"\",'Eingaben (Inputs)'!C298,\"\")","v":"Anschaffungspreis inkl. Flottenrabatt E-Fahrzeug"},{"$f":"IF('Eingaben (Inputs)'!D298<>\"\",'Eingaben (Inputs)'!D298,'1a. Defaults Segment-Ebene'!D298)","v":{"v":28810.890000000003,"d":"28,811"}},{"$f":"IF('Eingaben (Inputs)'!E298<>\"\",'Eingaben (Inputs)'!E298,\"\")","v":"CHF"}]
[null,null,{"$f":"IF('Eingaben (Inputs)'!C299<>\"\",'Eingaben (Inputs)'!C299,\"\")","v":"Service- und Reparaturkosten E-Fahrzeug"},{"$f":"IF('Eingaben (Inputs)'!D299<>\"\",'Eingaben (Inputs)'!D299,'1a. Defaults Segment-Ebene'!D299)","v":0.025},{"$f":"IF('Eingaben (Inputs)'!E299<>\"\",'Eingaben (Inputs)'!E299,\"\")","v":"CHF/km"}]
[null,null,{"$f":"IF('Eingaben (Inputs)'!C300<>\"\",'Eingaben (Inputs)'!C300,\"\")","v":"Restwert E-Fahrzeug"},{"$f":"IF('Eingaben (Inputs)'!D300<>\"\",'Eingaben (Inputs)'!D300,'1a. Defaults Segment-Ebene'!D300)","v":{"v":0.30658197222222217,"d":"31%"}},{"$f":"IF('Eingaben (Inputs)'!E300<>\"\",'Eingaben (Inputs)'!E300,\"\")","v":""}]
[null,null,{"$f":"IF('Eingaben (Inputs)'!C301<>\"\",'Eingaben (Inputs)'!C301,\"\")","v":""},null,{"$f":"IF('Eingaben (Inputs)'!E301<>\"\",'Eingaben (Inputs)'!E301,\"\")","v":""}]
[null,null,{"$f":"IF('Eingaben (Inputs)'!C302<>\"\",'Eingaben (Inputs)'!C302,\"\")","v":""},null,{"$f":"IF('Eingaben (Inputs)'!E302<>\"\",'Eingaben (Inputs)'!E302,\"\")","v":""}]
[null,"2.9)",{"$f":"IF('Eingaben (Inputs)'!C303<>\"\",'Eingaben (Inputs)'!C303,\"\")","v":"Segment I"},{"$f":"D267+1","v":9},{"$f":"IF('Eingaben (Inputs)'!E303<>\"\",'Eingaben (Inputs)'!E303,\"\")","v":""}]
[null,null,{"$f":"IF('Eingaben (Inputs)'!C304<>\"\",'Eingaben (Inputs)'!C304,\"\")","v":""},null,{"$f":"IF('Eingaben (Inputs)'!E304<>\"\",'Eingaben (Inputs)'!E304,\"\")","v":""}]
[null,null,{"$f":"IF('Eingaben (Inputs)'!C305<>\"\",'Eingaben (Inputs)'!C305,\"\")","v":"Segmentstruktur"},null,{"$f":"IF('Eingaben (Inputs)'!E305<>\"\",'Eingaben (Inputs)'!E305,\"\")","v":""}]
[null,null,{"$f":"IF('Eingaben (Inputs)'!C306<>\"\",'Eingaben (Inputs)'!C306,\"\")","v":"Anzahl Fahrzeuge"},{"$f":"IF(D303<=$D$12,'Eingaben (Inputs)'!D306,0)","v":0},{"$f":"IF('Eingaben (Inputs)'!E306<>\"\",'Eingaben (Inputs)'!E306,\"\")","v":""}]
[null,null,{"$f":"IF('Eingaben (Inputs)'!C307<>\"\",'Eingaben (Inputs)'!C307,\"\")","v":"Einsatzart"},{"$f":"'Eingaben (Inputs)'!D307","v":"Poolfahrzeuge"},{"$f":"IF('Eingaben (Inputs)'!E307<>\"\",'Eingaben (Inputs)'!E307,\"\")","v":""}]
[null,null,{"$f":"IF('Eingaben (Inputs)'!C308<>\"\",'Eingaben (Inputs)'!C308,\"\")","v":"Einsatzgebiet"},{"$f":"'Eingaben (Inputs)'!D308","v":"regional"},{"$f":"IF('Eingaben (Inputs)'!E308<>\"\",'Eingaben (Inputs)'!E308,\"\")","v":""}]
[null,null,{"$f":"IF('Eingaben (Inputs)'!C309<>\"\",'Eingaben (Inputs)'!C309,\"\")","v":"Heimlademöglichkeit"},{"$f":"INDEX(OFFSET(Heimladen,0,1),_xlfn.XMATCH('Eingaben (Inputs)'!D309,Heimladen))","v":0},{"$f":"IF('Eingaben (Inputs)'!E309<>\"\",'Eingaben (Inputs)'!E309,\"\")","v":""}]
[null,null,{"$f":"IF('Eingaben (Inputs)'!C310<>\"\",'Eingaben (Inputs)'!C310,\"\")","v":""},null,{"$f":"IF('Eingaben (Inputs)'!E310<>\"\",'Eingaben (Inputs)'!E310,\"\")","v":""}]
[null,null,{"$f":"IF('Eingaben (Inputs)'!C311<>\"\",'Eingaben (Inputs)'!C311,\"\")","v":"Fahrzeugdaten"},null,{"$f":"IF('Eingaben (Inputs)'!E311<>\"\",'Eingaben (Inputs)'!E311,\"\")","v":""}]
[null,null,{"$f":"IF('Eingaben (Inputs)'!C312<>\"\",'Eingaben (Inputs)'!C312,\"\")","v":"Fahrzeuggrösse"},{"$f":"'Eingaben (Inputs)'!D312","v":"Mittelklasse"},{"$f":"IF('Eingaben (Inputs)'!E312<>\"\",'Eingaben (Inputs)'!E312,\"\")","v":""}]
[null,null,{"$f":"IF('Eingaben (Inputs)'!C313<>\"\",'Eingaben (Inputs)'!C313,\"\")","v":"Treibstoffverbrauch Verbrenner"},{"$f":"IF('Eingaben (Inputs)'!D313<>\"\",'Eingaben (Inputs)'!D313,'1a. Defaults Segment-Ebene'!D313)","v":5.8},{"$f":"IF('Eingaben (Inputs)'!E313<>\"\",'Eingaben (Inputs)'!E313,\"\")","v":"l/100 km"}]
[null,null,{"$f":"IF('Eingaben (Inputs)'!C314<>\"\",'Eingaben (Inputs)'!C314,\"\")","v":"Energieverbrauch E-Fahrzeug"},{"$f":"IF('Eingaben (Inputs)'!D314<>\"\",'Eingaben (Inputs)'!D314,'1a. Defaults Segment-Ebene'!D314)","v":15.1},{"$f":"IF('Eingaben (Inputs)'!E314<>\"\",'Eingaben (Inputs)'!E314,\"\")","v":"kWh/100 km"}]
[null,null,{"$f":"IF('Eingaben (Inputs)'!C315<>\"\",'Eingaben (Inputs)'!C315,\"\")","v":"Batteriekapazität (netto)"},{"$f":"IF('Eingaben (Inputs)'!D315<>\"\",'Eingaben (Inputs)'!D315,'1a. Defaults Segment-Ebene'!D315)","v":58.625},{"$f":"IF('Eingaben (Inputs)'!E315<>\"\",'Eingaben (Inputs)'!E315,\"\")","v":"kWh"}]
[null,null,{"$f":"IF('Eingaben (Inputs)'!C316<>\"\",'Eingaben (Inputs)'!C316,\"\")","v":""},null,{"$f":"IF('Eingaben (Inputs)'!E316<>\"\",'Eingaben (Inputs)'!E316,\"\")","v":""}]
[null,null,{"$f":"IF('Eingaben (Inputs)'!C317<>\"\",'Eingaben (Inputs)'!C317,\"\")","v":"Fahr- und Nutzungsprofil (Angabe pro Fahrzeug)"},null,{"$f":"IF('Eingaben (Inputs)'!E317<>\"\",'Eingaben (Inputs)'!E317,\"\")","v":""}]
[null,null,{"$f":"IF('Eingaben (Inputs)'!C318<>\"\",'Eingaben (Inputs)'!C318,\"\")","v":"Nutzungsmuster"},{"$f":"'Eingaben (Inputs)'!D318","v":"Werktagsbetrieb"},{"$f":"IF('Eingaben (Inputs)'!E318<>\"\",'Eingaben (Inputs)'!E318,\"\")","v":""}]
[null,null,{"$f":"IF('Eingaben (Inputs)'!C319<>\"\",'Eingaben (Inputs)'!C319,\"\")","v":"Anzahl Arbeitstage pro Jahr"},{"$f":"IF('Eingaben (Inputs)'!D319<>\"\",'Eingaben (Inputs)'!D319,'1a. Defaults Segment-Ebene'!D319)","v":260},{"$f":"IF('Eingaben (Inputs)'!E319<>\"\",'Eingaben (Inputs)'!E319,\"\")","v":""}]
[null,null,{"$f":"IF('Eingaben (Inputs)'!C320<>\"\",'Eingaben (Inputs)'!C320,\"\")","v":"Fahrdistanz während der Arbeitszeit"},{"$f":"IF('Eingaben (Inputs)'!D320<>\"\",'Eingaben (Inputs)'!D320,'1a. Defaults Segment-Ebene'!D320)","v":100},{"$f":"IF('Eingaben (Inputs)'!E320<>\"\",'Eingaben (Inputs)'!E320,\"\")","v":"km/Tag"}]
[null,null,{"$f":"IF('Eingaben (Inputs)'!C321<>\"\",'Eingaben (Inputs)'!C321,\"\")","v":"Pendeldistanz (Hin- und Rückfahrt)"},{"$f":"(_xlfn.XMATCH(D307,Einsatzart)-1)*IF('Eingaben (Inputs)'!D321<>\"\",'Eingaben (Inputs)'!D321,'1a. Defaults Segment-Ebene'!D321)","v":0},{"$f":"IF('Eingaben (Inputs)'!E321<>\"\",'Eingaben (Inputs)'!E321,\"\")","v":"km/Tag"}]
[null,null,{"$f":"IF('Eingaben (Inputs)'!C322<>\"\",'Eingaben (Inputs)'!C322,\"\")","v":"Anzahl Einsätze pro Tag"},{"$f":"IF('Eingaben (Inputs)'!D322<>\"\",'Eingaben (Inputs)'!D322,'1a. Defaults Segment-Ebene'!D322)","v":1},{"$f":"IF('Eingaben (Inputs)'!E322<>\"\",'Eingaben (Inputs)'!E322,\"\")","v":""}]
[null,null,{"$f":"IF('Eingaben (Inputs)'!C323<>\"\",'Eingaben (Inputs)'!C323,\"\")","v":"Anzahl Pausen pro Tag"},{"$f":"'Eingaben (Inputs)'!D323","v":1},{"$f":"IF('Eingaben (Inputs)'!E323<>\"\",'Eingaben (Inputs)'!E323,\"\")","v":""}]
[null,null,{"$f":"IF('Eingaben (Inputs)'!C324<>\"\",'Eingaben (Inputs)'!C324,\"\")","v":"Standzeit pro Pause am Firmenstandort"},{"$f":"IF('Eingaben (Inputs)'!D324<>\"\",'Eingaben (Inputs)'!D324,'1a. Defaults Segment-Ebene'!D324)","v":1},{"$f":"IF('Eingaben (Inputs)'!E324<>\"\",'Eingaben (Inputs)'!E324,\"\")","v":"Stunden"}]
[null,null,{"$f":"IF('Eingaben (Inputs)'!C325<>\"\",'Eingaben (Inputs)'!C325,\"\")","v":"Standzeit über Nacht"},{"$f":"IF('Eingaben (Inputs)'!D325<>\"\",'Eingaben (Inputs)'!D325,'1a. Defaults Segment-Ebene'!D325)*IF(AND(_xlfn.XMATCH(D307,Einsatzart)=2,NOT(D309)),0,1)","v":8},{"$f":"IF('Eingaben (Inputs)'!E325<>\"\",'Eingaben (Inputs)'!E325,\"\")","v":"Stunden"}]
[null,null,{"$f":"IF('Eingaben (Inputs)'!C326<>\"\",'Eingaben (Inputs)'!C326,\"\")","v":"Fahrzeuge pro Ladepunkt, Firmenstandort (tagsüber)"},{"$f":"IF('Eingaben (Inputs)'!D326<>\"\",'Eingaben (Inputs)'!D326,'1a. Defaults Segment-Ebene'!D326)","v":1},{"$f":"IF('Eingaben (Inputs)'!E326<>\"\",'Eingaben (Inputs)'!E326,\"\")","v":""}]
[null,null,{"$f":"IF('Eingaben (Inputs)'!C327<>\"\",'Eingaben (Inputs)'!C327,\"\")","v":""},null,{"$f":"IF('Eingaben (Inputs)'!E327<>\"\",'Eingaben (Inputs)'!E327,\"\")","v":""}]
[null,null,{"$f":"IF('Eingaben (Inputs)'!C328<>\"\",'Eingaben (Inputs)'!C328,\"\")","v":"Kosten (Angabe pro Fahrzeug)"},null,{"$f":"IF('Eingaben (Inputs)'!E328<>\"\",'Eingaben (Inputs)'!E328,\"\")","v":""}]
[null,null,{"$f":"IF('Eingaben (Inputs)'!C329<>\"\",'Eingaben (Inputs)'!C329,\"\")","v":"Laufzeit"},{"$f":"IF('Eingaben (Inputs)'!D329<>\"\",'Eingaben (Inputs)'!D329,'1a. Defaults Segment-Ebene'!D329)","v":48},{"$f":"IF('Eingaben (Inputs)'!E329<>\"\",'Eingaben (Inputs)'!E329,\"\")","v":"Monate"}]
[null,null,{"$f":"IF('Eingaben (Inputs)'!C330<>\"\",'Eingaben (Inputs)'!C330,\"\")","v":"Leasing-Zinssatz"},{"$f":"IF('Eingaben (Inputs)'!D330<>\"\",'Eingaben (Inputs)'!D330,'1a. Defaults Segment-Ebene'!D330)","v":{"v":0.03,"d":"3.0%"}},{"$f":"IF('Eingaben (Inputs)'!E330<>\"\",'Eingaben (Inputs)'!E330,\"\")","v":""}]
[null,null,{"$f":"IF('Eingaben (Inputs)'!C331<>\"\",'Eingaben (Inputs)'!C331,\"\")","v":"Anschaffungspreis inkl. Flottenrabatt Verbrenner"},{"$f":"IF('Eingaben (Inputs)'!D331<>\"\",'Eingaben (Inputs)'!D331,'1a. Defaults Segment-Ebene'!D331)","v":{"v":27219.464999999997,"d":"27,219"}},{"$f":"IF('Eingaben (Inputs)'!E331<>\"\",'Eingaben (Inputs)'!E331,\"\")","v":"CHF"}]
[null,null,{"$f":"IF('Eingaben (Inputs)'!C332<>\"\",'Eingaben (Inputs)'!C332,\"\")","v":"Service- und Reparaturkosten Verbrenner"},{"$f":"IF('Eingaben (Inputs)'!D332<>\"\",'Eingaben (Inputs)'!D332,'1a. Defaults Segment-Ebene'!D332)","v":0.05},{"$f":"IF('Eingaben (Inputs)'!E332<>\"\",'Eingaben (Inputs)'!E332,\"\")","v":"CHF/km"}]
[null,null,{"$f":"IF('Eingaben (Inputs)'!C333<>\"\",'Eingaben (Inputs)'!C333,\"\")","v":"Restwert Verbrenner"},{"$f":"IF('Eingaben (Inputs)'!D333<>\"\",'Eingaben (Inputs)'!D333,'1a. Defaults Segment-Ebene'!D333)","v":{"v":0.31606388888888887,"d":"32%"}},{"$f":"IF('Eingaben (Inputs)'!E333<>\"\",'Eingaben (Inputs)'!E333,\"\")","v":""}]
[null,null,{"$f":"IF('Eingaben (Inputs)'!C334<>\"\",'Eingaben (Inputs)'!C334,\"\")","v":"Anschaffungspreis inkl. Flottenrabatt E-Fahrzeug"},{"$f":"IF('Eingaben (Inputs)'!D334<>\"\",'Eingaben (Inputs)'!D334,'1a. Defaults Segment-Ebene'!D334)","v":{"v":28810.890000000003,"d":"28,811"}},{"$f":"IF('Eingaben (Inputs)'!E334<>\"\",'Eingaben (Inputs)'!E334,\"\")","v":"CHF"}]
[null,null,{"$f":"IF('Eingaben (Inputs)'!C335<>\"\",'Eingaben (Inputs)'!C335,\"\")","v":"Service- und Reparaturkosten E-Fahrzeug"},{"$f":"IF('Eingaben (Inputs)'!D335<>\"\",'Eingaben (Inputs)'!D335,'1a. Defaults Segment-Ebene'!D335)","v":0.025},{"$f":"IF('Eingaben (Inputs)'!E335<>\"\",'Eingaben (Inputs)'!E335,\"\")","v":"CHF/km"}]
[null,null,{"$f":"IF('Eingaben (Inputs)'!C336<>\"\",'Eingaben (Inputs)'!C336,\"\")","v":"Restwert E-Fahrzeug"},{"$f":"IF('Eingaben (Inputs)'!D336<>\"\",'Eingaben (Inputs)'!D336,'1a. Defaults Segment-Ebene'!D336)","v":{"v":0.30658197222222217,"d":"31%"}},{"$f":"IF('Eingaben (Inputs)'!E336<>\"\",'Eingaben (Inputs)'!E336,\"\")","v":""}]
[null,null,{"$f":"IF('Eingaben (Inputs)'!C337<>\"\",'Eingaben (Inputs)'!C337,\"\")","v":""},null,{"$f":"IF('Eingaben (Inputs)'!E337<>\"\",'Eingaben (Inputs)'!E337,\"\")","v":""}]
[null,null,{"$f":"IF('Eingaben (Inputs)'!C338<>\"\",'Eingaben (Inputs)'!C338,\"\")","v":""},null,{"$f":"IF('Eingaben (Inputs)'!E338<>\"\",'Eingaben (Inputs)'!E338,\"\")","v":""}]
[null,"2.10)",{"$f":"IF('Eingaben (Inputs)'!C339<>\"\",'Eingaben (Inputs)'!C339,\"\")","v":"Segment J"},{"$f":"D303+1","v":10},{"$f":"IF('Eingaben (Inputs)'!E339<>\"\",'Eingaben (Inputs)'!E339,\"\")","v":""}]
[null,null,{"$f":"IF('Eingaben (Inputs)'!C340<>\"\",'Eingaben (Inputs)'!C340,\"\")","v":""},null,{"$f":"IF('Eingaben (Inputs)'!E340<>\"\",'Eingaben (Inputs)'!E340,\"\")","v":""}]
[null,null,{"$f":"IF('Eingaben (Inputs)'!C341<>\"\",'Eingaben (Inputs)'!C341,\"\")","v":"Segmentstruktur"},null,{"$f":"IF('Eingaben (Inputs)'!E341<>\"\",'Eingaben (Inputs)'!E341,\"\")","v":""}]
[null,null,{"$f":"IF('Eingaben (Inputs)'!C342<>\"\",'Eingaben (Inputs)'!C342,\"\")","v":"Anzahl Fahrzeuge"},{"$f":"IF(D339<=$D$12,'Eingaben (Inputs)'!D342,0)","v":0},{"$f":"IF('Eingaben (Inputs)'!E342<>\"\",'Eingaben (Inputs)'!E342,\"\")","v":""}]
[null,null,{"$f":"IF('Eingaben (Inputs)'!C343<>\"\",'Eingaben (Inputs)'!C343,\"\")","v":"Einsatzart"},{"$f":"'Eingaben (Inputs)'!D343","v":"Poolfahrzeuge"},{"$f":"IF('Eingaben (Inputs)'!E343<>\"\",'Eingaben (Inputs)'!E343,\"\")","v":""}]
[null,null,{"$f":"IF('Eingaben (Inputs)'!C344<>\"\",'Eingaben (Inputs)'!C344,\"\")","v":"Einsatzgebiet"},{"$f":"'Eingaben (Inputs)'!D344","v":"regional"},{"$f":"IF('Eingaben (Inputs)'!E344<>\"\",'Eingaben (Inputs)'!E344,\"\")","v":""}]
[null,null,{"$f":"IF('Eingaben (Inputs)'!C345<>\"\",'Eingaben (Inputs)'!C345,\"\")","v":"Heimlademöglichkeit"},{"$f":"INDEX(OFFSET(Heimladen,0,1),_xlfn.XMATCH('Eingaben (Inputs)'!D345,Heimladen))","v":0},{"$f":"IF('Eingaben (Inputs)'!E345<>\"\",'Eingaben (Inputs)'!E345,\"\")","v":""}]
[null,null,{"$f":"IF('Eingaben (Inputs)'!C346<>\"\",'Eingaben (Inputs)'!C346,\"\")","v":""},null,{"$f":"IF('Eingaben (Inputs)'!E346<>\"\",'Eingaben (Inputs)'!E346,\"\")","v":""}]
[null,null,{"$f":"IF('Eingaben (Inputs)'!C347<>\"\",'Eingaben (Inputs)'!C347,\"\")","v":"Fahrzeugdaten"},null,{"$f":"IF('Eingaben (Inputs)'!E347<>\"\",'Eingaben (Inputs)'!E347,\"\")","v":""}]
[null,null,{"$f":"IF('Eingaben (Inputs)'!C348<>\"\",'Eingaben (Inputs)'!C348,\"\")","v":"Fahrzeuggrösse"},{"$f":"'Eingaben (Inputs)'!D348","v":"Mittelklasse"},{"$f":"IF('Eingaben (Inputs)'!E348<>\"\",'Eingaben (Inputs)'!E348,\"\")","v":""}]
[null,null,{"$f":"IF('Eingaben (Inputs)'!C349<>\"\",'Eingaben (Inputs)'!C349,\"\")","v":"Treibstoffverbrauch Verbrenner"},{"$f":"IF('Eingaben (Inputs)'!D349<>\"\",'Eingaben (Inputs)'!D349,'1a. Defaults Segment-Ebene'!D349)","v":5.8},{"$f":"IF('Eingaben (Inputs)'!E349<>\"\",'Eingaben (Inputs)'!E349,\"\")","v":"l/100 km"}]
[null,null,{"$f":"IF('Eingaben (Inputs)'!C350<>\"\",'Eingaben (Inputs)'!C350,\"\")","v":"Energieverbrauch E-Fahrzeug"},{"$f":"IF('Eingaben (Inputs)'!D350<>\"\",'Eingaben (Inputs)'!D350,'1a. Defaults Segment-Ebene'!D350)","v":15.1},{"$f":"IF('Eingaben (Inputs)'!E350<>\"\",'Eingaben (Inputs)'!E350,\"\")","v":"kWh/100 km"}]
[null,null,{"$f":"IF('Eingaben (Inputs)'!C351<>\"\",'Eingaben (Inputs)'!C351,\"\")","v":"Batteriekapazität (netto)"},{"$f":"IF('Eingaben (Inputs)'!D351<>\"\",'Eingaben (Inputs)'!D351,'1a. Defaults Segment-Ebene'!D351)","v":58.625},{"$f":"IF('Eingaben (Inputs)'!E351<>\"\",'Eingaben (Inputs)'!E351,\"\")","v":"kWh"}]
[null,null,{"$f":"IF('Eingaben (Inputs)'!C352<>\"\",'Eingaben (Inputs)'!C352,\"\")","v":""},null,{"$f":"IF('Eingaben (Inputs)'!E352<>\"\",'Eingaben (Inputs)'!E352,\"\")","v":""}]
[null,null,{"$f":"IF('Eingaben (Inputs)'!C353<>\"\",'Eingaben (Inputs)'!C353,\"\")","v":"Fahr- und Nutzungsprofil (Angabe pro Fahrzeug)"},null,{"$f":"IF('Eingaben (Inputs)'!E353<>\"\",'Eingaben (Inputs)'!E353,\"\")","v":""}]
[null,null,{"$f":"IF('Eingaben (Inputs)'!C354<>\"\",'Eingaben (Inputs)'!C354,\"\")","v":"Nutzungsmuster"},{"$f":"'Eingaben (Inputs)'!D354","v":"Werktagsbetrieb"},{"$f":"IF('Eingaben (Inputs)'!E354<>\"\",'Eingaben (Inputs)'!E354,\"\")","v":""}]
[null,null,{"$f":"IF('Eingaben (Inputs)'!C355<>\"\",'Eingaben (Inputs)'!C355,\"\")","v":"Anzahl Arbeitstage pro Jahr"},{"$f":"IF('Eingaben (Inputs)'!D355<>\"\",'Eingaben (Inputs)'!D355,'1a. Defaults Segment-Ebene'!D355)","v":260},{"$f":"IF('Eingaben (Inputs)'!E355<>\"\",'Eingaben (Inputs)'!E355,\"\")","v":""}]
[null,null,{"$f":"IF('Eingaben (Inputs)'!C356<>\"\",'Eingaben (Inputs)'!C356,\"\")","v":"Fahrdistanz während der Arbeitszeit"},{"$f":"IF('Eingaben (Inputs)'!D356<>\"\",'Eingaben (Inputs)'!D356,'1a. Defaults Segment-Ebene'!D356)","v":100},{"$f":"IF('Eingaben (Inputs)'!E356<>\"\",'Eingaben (Inputs)'!E356,\"\")","v":"km/Tag"}]
[null,null,{"$f":"IF('Eingaben (Inputs)'!C357<>\"\",'Eingaben (Inputs)'!C357,\"\")","v":"Pendeldistanz (Hin- und Rückfahrt)"},{"$f":"(_xlfn.XMATCH(D343,Einsatzart)-1)*IF('Eingaben (Inputs)'!D357<>\"\",'Eingaben (Inputs)'!D357,'1a. Defaults Segment-Ebene'!D357)","v":0},{"$f":"IF('Eingaben (Inputs)'!E357<>\"\",'Eingaben (Inputs)'!E357,\"\")","v":"km/Tag"}]
[null,null,{"$f":"IF('Eingaben (Inputs)'!C358<>\"\",'Eingaben (Inputs)'!C358,\"\")","v":"Anzahl Einsätze pro Tag"},{"$f":"IF('Eingaben (Inputs)'!D358<>\"\",'Eingaben (Inputs)'!D358,'1a. Defaults Segment-Ebene'!D358)","v":1},{"$f":"IF('Eingaben (Inputs)'!E358<>\"\",'Eingaben (Inputs)'!E358,\"\")","v":""}]
[null,null,{"$f":"IF('Eingaben (Inputs)'!C359<>\"\",'Eingaben (Inputs)'!C359,\"\")","v":"Anzahl Pausen pro Tag"},{"$f":"'Eingaben (Inputs)'!D359","v":1},{"$f":"IF('Eingaben (Inputs)'!E359<>\"\",'Eingaben (Inputs)'!E359,\"\")","v":""}]
[null,null,{"$f":"IF('Eingaben (Inputs)'!C360<>\"\",'Eingaben (Inputs)'!C360,\"\")","v":"Standzeit pro Pause am Firmenstandort"},{"$f":"IF('Eingaben (Inputs)'!D360<>\"\",'Eingaben (Inputs)'!D360,'1a. Defaults Segment-Ebene'!D360)","v":1},{"$f":"IF('Eingaben (Inputs)'!E360<>\"\",'Eingaben (Inputs)'!E360,\"\")","v":"Stunden"}]
[null,null,{"$f":"IF('Eingaben (Inputs)'!C361<>\"\",'Eingaben (Inputs)'!C361,\"\")","v":"Standzeit über Nacht"},{"$f":"IF('Eingaben (Inputs)'!D361<>\"\",'Eingaben (Inputs)'!D361,'1a. Defaults Segment-Ebene'!D361)*IF(AND(_xlfn.XMATCH(D343,Einsatzart)=2,NOT(D345)),0,1)","v":8},{"$f":"IF('Eingaben (Inputs)'!E361<>\"\",'Eingaben (Inputs)'!E361,\"\")","v":"Stunden"}]
[null,null,{"$f":"IF('Eingaben (Inputs)'!C362<>\"\",'Eingaben (Inputs)'!C362,\"\")","v":"Fahrzeuge pro Ladepunkt, Firmenstandort (tagsüber)"},{"$f":"IF('Eingaben (Inputs)'!D362<>\"\",'Eingaben (Inputs)'!D362,'1a. Defaults Segment-Ebene'!D362)","v":1},{"$f":"IF('Eingaben (Inputs)'!E362<>\"\",'Eingaben (Inputs)'!E362,\"\")","v":""}]
[null,null,{"$f":"IF('Eingaben (Inputs)'!C363<>\"\",'Eingaben (Inputs)'!C363,\"\")","v":""},null,{"$f":"IF('Eingaben (Inputs)'!E363<>\"\",'Eingaben (Inputs)'!E363,\"\")","v":""}]
[null,null,{"$f":"IF('Eingaben (Inputs)'!C364<>\"\",'Eingaben (Inputs)'!C364,\"\")","v":"Kosten (Angabe pro Fahrzeug)"},null,{"$f":"IF('Eingaben (Inputs)'!E364<>\"\",'Eingaben (Inputs)'!E364,\"\")","v":""}]
[null,null,{"$f":"IF('Eingaben (Inputs)'!C365<>\"\",'Eingaben (Inputs)'!C365,\"\")","v":"Laufzeit"},{"$f":"IF('Eingaben (Inputs)'!D365<>\"\",'Eingaben (Inputs)'!D365,'1a. Defaults Segment-Ebene'!D365)","v":48},{"$f":"IF('Eingaben (Inputs)'!E365<>\"\",'Eingaben (Inputs)'!E365,\"\")","v":"Monate"}]
[null,null,{"$f":"IF('Eingaben (Inputs)'!C366<>\"\",'Eingaben (Inputs)'!C366,\"\")","v":"Leasing-Zinssatz"},{"$f":"IF('Eingaben (Inputs)'!D366<>\"\",'Eingaben (Inputs)'!D366,'1a. Defaults Segment-Ebene'!D366)","v":{"v":0.03,"d":"3.0%"}},{"$f":"IF('Eingaben (Inputs)'!E366<>\"\",'Eingaben (Inputs)'!E366,\"\")","v":""}]
[null,null,{"$f":"IF('Eingaben (Inputs)'!C367<>\"\",'Eingaben (Inputs)'!C367,\"\")","v":"Anschaffungspreis inkl. Flottenrabatt Verbrenner"},{"$f":"IF('Eingaben (Inputs)'!D367<>\"\",'Eingaben (Inputs)'!D367,'1a. Defaults Segment-Ebene'!D367)","v":{"v":27219.464999999997,"d":"27,219"}},{"$f":"IF('Eingaben (Inputs)'!E367<>\"\",'Eingaben (Inputs)'!E367,\"\")","v":"CHF"}]
[null,null,{"$f":"IF('Eingaben (Inputs)'!C368<>\"\",'Eingaben (Inputs)'!C368,\"\")","v":"Service- und Reparaturkosten Verbrenner"},{"$f":"IF('Eingaben (Inputs)'!D368<>\"\",'Eingaben (Inputs)'!D368,'1a. Defaults Segment-Ebene'!D368)","v":0.05},{"$f":"IF('Eingaben (Inputs)'!E368<>\"\",'Eingaben (Inputs)'!E368,\"\")","v":"CHF/km"}]
[null,null,{"$f":"IF('Eingaben (Inputs)'!C369<>\"\",'Eingaben (Inputs)'!C369,\"\")","v":"Restwert Verbrenner"},{"$f":"IF('Eingaben (Inputs)'!D369<>\"\",'Eingaben (Inputs)'!D369,'1a. Defaults Segment-Ebene'!D369)","v":{"v":0.31606388888888887,"d":"32%"}},{"$f":"IF('Eingaben (Inputs)'!E369<>\"\",'Eingaben (Inputs)'!E369,\"\")","v":""}]
[null,null,{"$f":"IF('Eingaben (Inputs)'!C370<>\"\",'Eingaben (Inputs)'!C370,\"\")","v":"Anschaffungspreis inkl. Flottenrabatt E-Fahrzeug"},{"$f":"IF('Eingaben (Inputs)'!D370<>\"\",'Eingaben (Inputs)'!D370,'1a. Defaults Segment-Ebene'!D370)","v":{"v":28810.890000000003,"d":"28,811"}},{"$f":"IF('Eingaben (Inputs)'!E370<>\"\",'Eingaben (Inputs)'!E370,\"\")","v":"CHF"}]
[null,null,{"$f":"IF('Eingaben (Inputs)'!C371<>\"\",'Eingaben (Inputs)'!C371,\"\")","v":"Service- und Reparaturkosten E-Fahrzeug"},{"$f":"IF('Eingaben (Inputs)'!D371<>\"\",'Eingaben (Inputs)'!D371,'1a. Defaults Segment-Ebene'!D371)","v":0.025},{"$f":"IF('Eingaben (Inputs)'!E371<>\"\",'Eingaben (Inputs)'!E371,\"\")","v":"CHF/km"}]
[null,null,{"$f":"IF('Eingaben (Inputs)'!C372<>\"\",'Eingaben (Inputs)'!C372,\"\")","v":"Restwert E-Fahrzeug"},{"$f":"IF('Eingaben (Inputs)'!D372<>\"\",'Eingaben (Inputs)'!D372,'1a. Defaults Segment-Ebene'!D372)","v":{"v":0.30658197222222217,"d":"31%"}},{"$f":"IF('Eingaben (Inputs)'!E372<>\"\",'Eingaben (Inputs)'!E372,\"\")","v":""}]

{"sheet":"1c. Inputs Segment Summary","index":5,"n_rows":12,"n_cols":31,"rows_kept":12,"hidden":true,"merged":[[11,1,11,3]]}
[null,"Anzahl Fahrzeuge","… davon Poolfahrzeug","… davon Dienstfahrzeuge","Einsatzart","Anzahl Fahrzeuge","… davon Poolfahrzeug","… davon Dienstfahrzeuge","Einsatzgebiet","Laden am Wohnort möglich?","Fahrzeuggrösse","Batteriekapazität (nutzbar)","Energieverbrauch (E-Fahrzeug)","Treibstoffverbrauch (Verbrenner)","Nutzungsmuster","Anzahl Arbeitstage pro Jahr","Ø Fahrleistung während der Arbeitszeit","Ø Pendeldistanz (Hin- und Rückfahrt)","Anzahl Einsätze pro Tag","Anzahl Pausen pro Tag","Ø Standzeit pro Pause","Ø Standzeit über Nacht","Fahrzeuge pro Ladepunkt","Anschaffung (E-Fahrzeug, netto)","Anschaffung (Verbrenner, netto)","Zinssatz","Laufzeit","Wartungs- und Betriebskosten (Verbrenner)","Restwert (Verbrenner)","Wartungs- und Betriebskosten (E-Fzg.)","Restwert (E-Fzg.)"]
["Segment A",{"$f":"SUM(F$2:F2)","v":1},{"$f":"SUM(G$2:G2)","v":1},{"$f":"SUM(H$2:H2)","v":0},{"$f":"'1b. Corrected Inputs Segment'!$D$19","v":"Poolfahrzeuge"},{"$f":"'1b. Corrected Inputs Segment'!$D$18","v":1},{"$f":"IF(E2=INDEX(Einsatzart,1),F2,0)","v":1},{"$f":"IF(E2=INDEX(Einsatzart,1),0,F2)","v":0},{"$f":"'1b. Corrected Inputs Segment'!$D$20","v":"regional"},{"$f":"'1b. Corrected Inputs Segment'!$D$21","v":0},{"$f":"'1b. Corrected Inputs Segment'!$D$24","v":"Mittelklasse"},{"$f":"'1b. Corrected Inputs Segment'!$D$27*'2d. Annahmen'!$G$2","v":46.900000000000006},{"$f":"'1b. Corrected Inputs Segment'!$D$26","v":15.1},{"$f":"'1b. Corrected Inputs Segment'!$D$25","v":5.8},{"$f":"'1b. Corrected Inputs Segment'!$D$30","v":"Werktagsbetrieb"},{"$f":"'1b. Corrected Inputs Segment'!$D$31","v":260},{"$f":"'1b. Corrected Inputs Segment'!$D$32","v":100},{"$f":"'1b. Corrected Inputs Segment'!$D$33","v":0},{"$f":"'1b. Corrected Inputs Segment'!$D$34","v":1},{"$f":"'1b. Corrected Inputs Segment'!$D$35","v":1},{"$f":"'1b. Corrected Inputs Segment'!$D$36","v":{"v":1,"d":"1.0"}},{"$f":"'1b. Corrected Inputs Segment'!$D$37","v":{"v":8,"d":"8.0"}},{"$f":"'1b. Corrected Inputs Segment'!$D$38","v":{"v":1,"d":"1.0"}},{"$f":"'1b. Corrected Inputs Segment'!$D$46","v":{"v":28810.890000000003,"d":"28,811"}},{"$f":"'1b. Corrected Inputs Segment'!$D$43","v":{"v":27219.464999999997,"d":"27,219"}},{"$f":"'1b. Corrected Inputs Segment'!$D$42","v":{"v":0.03,"d":"3.0%"}},{"$f":"'1b. Corrected Inputs Segment'!$D$41","v":48},{"$f":"'1b. Corrected Inputs Segment'!$D$44","v":{"v":0.05,"d":"0.050"}},{"$f":"'1b. Corrected Inputs Segment'!$D$45","v":{"v":0.31606388888888887,"d":"32%"}},{"$f":"'1b. Corrected Inputs Segment'!$D$47","v":0.025},{"$f":"'1b. Corrected Inputs Segment'!$D$48","v":{"v":0.30658197222222217,"d":"31%"}}]
["Segment B",{"$f":"SUM(F$2:F3)","v":1},{"$f":"SUM(G$2:G3)","v":1},{"$f":"SUM(H$2:H3)","v":0},{"$f":"'1b. Corrected Inputs Segment'!$D$55","v":"Poolfahrzeuge"},{"$f":"'1b. Corrected Inputs Segment'!$D$54","v":0},{"$f":"IF(E3=INDEX(Einsatzart,1),F3,0)","v":0},{"$f":"IF(E3=INDEX(Einsatzart,1),0,F3)","v":0},{"$f":"'1b. Corrected Inputs Segment'!$D$56","v":"regional"},{"$f":"'1b. Corrected Inputs Segment'!$D$57","v":0},{"$f":"'1b. Corrected Inputs Segment'!$D$60","v":"Mittelklasse"},{"$f":"'1b. Corrected Inputs Segment'!$D$63*'2d. Annahmen'!$G$2","v":{"v":46.900000000000006,"d":"46.90"}},{"$f":"'1b. Corrected Inputs Segment'!$D$62","v":15.1},{"$f":"'1b. Corrected Inputs Segment'!$D$61","v":5.8},{"$f":"'1b. Corrected Inputs Segment'!$D$66","v":"Werktagsbetrieb"},{"$f":"'1b. Corrected Inputs Segment'!$D$67","v":260},{"$f":"'1b. Corrected Inputs Segment'!$D$68","v":100},{"$f":"'1b. Corrected Inputs Segment'!$D$69","v":0},{"$f":"'1b. Corrected Inputs Segment'!$D$70","v":1},{"$f":"'1b. Corrected Inputs Segment'!$D$71","v":1},{"$f":"'1b. Corrected Inputs Segment'!$D$72","v":{"v":1,"d":"1.0"}},{"$f":"'1b. Corrected Inputs Segment'!$D$73","v":{"v":8,"d":"8.0"}},{"$f":"'1b. Corrected Inputs Segment'!$D$74","v":{"v":1,"d":"1.0"}},{"$f":"'1b. Corrected Inputs Segment'!$D$82","v":{"v":28810.890000000003,"d":"28,811"}},{"$f":"'1b. Corrected Inputs Segment'!$D$79","v":{"v":27219.464999999997,"d":"27,219"}},{"$f":"'1b. Corrected Inputs Segment'!$D$78","v":{"v":0.03,"d":"3.0%"}},{"$f":"'1b. Corrected Inputs Segment'!$D$77","v":48},{"$f":"'1b. Corrected Inputs Segment'!$D$80","v":{"v":0.05,"d":"0.050"}},{"$f":"'1b. Corrected Inputs Segment'!$D$81","v":{"v":0.31606388888888887,"d":"32%"}},{"$f":"'1b. Corrected Inputs Segment'!$D$83","v":0.025},{"$f":"'1b. Corrected Inputs Segment'!$D$84","v":{"v":0.30658197222222217,"d":"31%"}}]
["Segment C",{"$f":"SUM(F$2:F4)","v":1},{"$f":"SUM(G$2:G4)","v":1},{"$f":"SUM(H$2:H4)","v":0},{"$f":"'1b. Corrected Inputs Segment'!$D$91","v":"Poolfahrzeuge"},{"$f":"'1b. Corrected Inputs Segment'!$D$90","v":0},0,0,{"$f":"'1b. Corrected Inputs Segment'!$D$92","v":"regional"},{"$f":"'1b. Corrected Inputs Segment'!$D$93","v":0},{"$f":"'1b. Corrected Inputs Segment'!$D$96","v":"Mittelklasse"},{"$f":"'1b. Corrected Inputs Segment'!$D$99*'2d. Annahmen'!$G$2","v":{"v":46.900000000000006,"d":"46.90"}},{"$f":"'1b. Corrected Inputs Segment'!$D$98","v":15.1},{"$f":"'1b. Corrected Inputs Segment'!$D$97","v":5.8},{"$f":"'1b. Corrected Inputs Segment'!$D$102","v":"Werktagsbetrieb"},{"$f":"'1b. Corrected Inputs Segment'!$D$103","v":260},{"$f":"'1b. Corrected Inputs Segment'!$D$104","v":100},{"$f":"'1b. Corrected Inputs Segment'!$D$105","v":0},{"$f":"'1b. Corrected Inputs Segment'!$D$106","v":1},{"$f":"'1b. Corrected Inputs Segment'!$D$107","v":1},{"$f":"'1b. Corrected Inputs Segment'!$D$108","v":{"v":1,"d":"1.0"}},{"$f":"'1b. Corrected Inputs Segment'!$D$109","v":{"v":8,"d":"8.0"}},{"$f":"'1b. Corrected Inputs Segment'!$D$110","v":{"v":1,"d":"1.0"}},{"$f":"'1b. Corrected Inputs Segment'!$D$118","v":{"v":28810.890000000003,"d":"28,811"}},{"$f":"'1b. Corrected Inputs Segment'!$D$115","v":{"v":27219.464999999997,"d":"27,219"}},{"$f":"'1b. Corrected Inputs Segment'!$D$114","v":{"v":0.03,"d":"3.0%"}},{"$f":"'1b. Corrected Inputs Segment'!$D$113","v":48},{"$f":"'1b. Corrected Inputs Segment'!$D$116","v":{"v":0.05,"d":"0.050"}},{"$f":"'1b. Corrected Inputs Segment'!$D$117","v":{"v":0.31606388888888887,"d":"32%"}},{"$f":"'1b. Corrected Inputs Segment'!$D$119","v":0.025},{"$f":"'1b. Corrected Inputs Segment'!$D$120","v":{"v":0.30658197222222217,"d":"31%"}}]
["Segment D",{"$f":"SUM(F$2:F5)","v":1},{"$f":"SUM(G$2:G5)","v":1},{"$f":"SUM(H$2:H5)","v":0},{"$f":"'1b. Corrected Inputs Segment'!$D$127","v":"Poolfahrzeuge"},{"$f":"'1b. Corrected Inputs Segment'!$D$126","v":0},0,0,{"$f":"'1b. Corrected Inputs Segment'!$D$128","v":"regional"},{"$f":"'1b. Corrected Inputs Segment'!$D$129","v":0},{"$f":"'1b. Corrected Inputs Segment'!$D$132","v":"Mittelklasse"},{"$f":"'1b. Corrected Inputs Segment'!$D$135*'2d. Annahmen'!$G$2","v":{"v":46.900000000000006,"d":"46.90"}},{"$f":"'1b. Corrected Inputs Segment'!$D$134","v":15.1},{"$f":"'1b. Corrected Inputs Segment'!$D$133","v":5.8},{"$f":"'1b. Corrected Inputs Segment'!$D$138","v":"Werktagsbetrieb"},{"$f":"'1b. Corrected Inputs Segment'!$D$139","v":260},{"$f":"'1b. Corrected Inputs Segment'!$D$140","v":100},{"$f":"'1b. Corrected Inputs Segment'!$D$141","v":0},{"$f":"'1b. Corrected Inputs Segment'!$D$142","v":1},{"$f":"'1b. Corrected Inputs Segment'!$D$143","v":1},{"$f":"'1b. Corrected Inputs Segment'!$D$144","v":{"v":1,"d":"1.0"}},{"$f":"'1b. Corrected Inputs Segment'!$D$145","v":{"v":8,"d":"8.0"}},{"$f":"'1b. Corrected Inputs Segment'!$D$146","v":{"v":1,"d":"1.0"}},{"$f":"'1b. Corrected Inputs Segment'!$D$154","v":{"v":28810.890000000003,"d":"28,811"}},{"$f":"'1b. Corrected Inputs Segment'!$D$151","v":{"v":27219.464999999997,"d":"27,219"}},{"$f":"'1b. Corrected Inputs Segment'!$D$150","v":{"v":0.03,"d":"3.0%"}},{"$f":"'1b. Corrected Inputs Segment'!$D$149","v":48},{"$f":"'1b. Corrected Inputs Segment'!$D$152","v":{"v":0.05,"d":"0.050"}},{"$f":"'1b. Corrected Inputs Segment'!$D$153","v":{"v":0.31606388888888887,"d":"32%"}},{"$f":"'1b. Corrected Inputs Segment'!$D$155","v":0.025},{"$f":"'1b. Corrected Inputs Segment'!$D$156","v":{"v":0.30658197222222217,"d":"31%"}}]
["Segment E",{"$f":"SUM(F$2:F6)","v":1},{"$f":"SUM(G$2:G6)","v":1},{"$f":"SUM(H$2:H6)","v":0},{"$f":"'1b. Corrected Inputs Segment'!$D$163","v":"Poolfahrzeuge"},{"$f":"'1b. Corrected Inputs Segment'!$D$162","v":0},0,0,{"$f":"'1b. Corrected Inputs Segment'!$D$164","v":"regional"},{"$f":"'1b. Corrected Inputs Segment'!$D$165","v":0},{"$f":"'1b. Corrected Inputs Segment'!$D$168","v":"Mittelklasse"},{"$f":"'1b. Corrected Inputs Segment'!$D$171*'2d. Annahmen'!$G$2","v":{"v":46.900000000000006,"d":"46.90"}},{"$f":"'1b. Corrected Inputs Segment'!$D$170","v":15.1},{"$f":"'1b. Corrected Inputs Segment'!$D$169","v":5.8},{"$f":"'1b. Corrected Inputs Segment'!$D$174","v":"Werktagsbetrieb"},{"$f":"'1b. Corrected Inputs Segment'!$D$175","v":260},{"$f":"'1b. Corrected Inputs Segment'!$D$176","v":100},{"$f":"'1b. Corrected Inputs Segment'!$D$177","v":0},{"$f":"'1b. Corrected Inputs Segment'!$D$178","v":1},{"$f":"'1b. Corrected Inputs Segment'!$D$179","v":1},{"$f":"'1b. Corrected Inputs Segment'!$D$180","v":{"v":1,"d":"1.0"}},{"$f":"'1b. Corrected Inputs Segment'!$D$181","v":{"v":8,"d":"8.0"}},{"$f":"'1b. Corrected Inputs Segment'!$D$182","v":{"v":1,"d":"1.0"}},{"$f":"'1b. Corrected Inputs Segment'!$D$190","v":{"v":28810.890000000003,"d":"28,811"}},{"$f":"'1b. Corrected Inputs Segment'!$D$187","v":{"v":27219.464999999997,"d":"27,219"}},{"$f":"'1b. Corrected Inputs Segment'!$D$186","v":{"v":0.03,"d":"3.0%"}},{"$f":"'1b. Corrected Inputs Segment'!$D$185","v":48},{"$f":"'1b. Corrected Inputs Segment'!$D$188","v":{"v":0.05,"d":"0.050"}},{"$f":"'1b. Corrected Inputs Segment'!$D$189","v":{"v":0.31606388888888887,"d":"32%"}},{"$f":"'1b. Corrected Inputs Segment'!$D$191","v":0.025},{"$f":"'1b. Corrected Inputs Segment'!$D$192","v":{"v":0.30658197222222217,"d":"31%"}}]
["Segment F",{"$f":"SUM(F$2:F7)","v":1},{"$f":"SUM(G$2:G7)","v":1},{"$f":"SUM(H$2:H7)","v":0},{"$f":"'1b. Corrected Inputs Segment'!$D$199","v":"Poolfahrzeuge"},{"$f":"'1b. Corrected Inputs Segment'!$D$198","v":0},0,0,{"$f":"'1b. Corrected Inputs Segment'!$D$200","v":"regional"},{"$f":"'1b. Corrected Inputs Segment'!$D$201","v":0},{"$f":"'1b. Corrected Inputs Segment'!$D$204","v":"Mittelklasse"},{"$f":"'1b. Corrected Inputs Segment'!$D$207*'2d. Annahmen'!$G$2","v":{"v":46.900000000000006,"d":"46.90"}},{"$f":"'1b. Corrected Inputs Segment'!$D$206","v":15.1},{"$f":"'1b. Corrected Inputs Segment'!$D$205","v":5.8},{"$f":"'1b. Corrected Inputs Segment'!$D$210","v":"Werktagsbetrieb"},{"$f":"'1b. Corrected Inputs Segment'!$D$211","v":260},{"$f":"'1b. Corrected Inputs Segment'!$D$212","v":100},{"$f":"'1b. Corrected Inputs Segment'!$D$213","v":0},{"$f":"'1b. Corrected Inputs Segment'!$D$214","v":1},{"$f":"'1b. Corrected Inputs Segment'!$D$215","v":1},{"$f":"'1b. Corrected Inputs Segment'!$D$216","v":{"v":1,"d":"1.0"}},{"$f":"'1b. Corrected Inputs Segment'!$D$217","v":{"v":8,"d":"8.0"}},{"$f":"'1b. Corrected Inputs Segment'!$D$218","v":{"v":1,"d":"1.0"}},{"$f":"'1b. Corrected Inputs Segment'!$D$226","v":{"v":28810.890000000003,"d":"28,811"}},{"$f":"'1b. Corrected Inputs Segment'!$D$223","v":{"v":27219.464999999997,"d":"27,219"}},{"$f":"'1b. Corrected Inputs Segment'!$D$222","v":{"v":0.03,"d":"3.0%"}},{"$f":"'1b. Corrected Inputs Segment'!$D$221","v":48},{"$f":"'1b. Corrected Inputs Segment'!$D$224","v":{"v":0.05,"d":"0.050"}},{"$f":"'1b. Corrected Inputs Segment'!$D$225","v":{"v":0.31606388888888887,"d":"32%"}},{"$f":"'1b. Corrected Inputs Segment'!$D$227","v":0.025},{"$f":"'1b. Corrected Inputs Segment'!$D$228","v":{"v":0.30658197222222217,"d":"31%"}}]
["Segment G",{"$f":"SUM(F$2:F8)","v":1},{"$f":"SUM(G$2:G8)","v":1},{"$f":"SUM(H$2:H8)","v":0},{"$f":"'1b. Corrected Inputs Segment'!$D$235","v":"Poolfahrzeuge"},{"$f":"'1b. Corrected Inputs Segment'!$D$234","v":0},0,0,{"$f":"'1b. Corrected Inputs Segment'!$D$236","v":"regional"},{"$f":"'1b. Corrected Inputs Segment'!$D$237","v":0},{"$f":"'1b. Corrected Inputs Segment'!$D$240","v":"Mittelklasse"},{"$f":"'1b. Corrected Inputs Segment'!$D$243*'2d. Annahmen'!$G$2","v":{"v":46.900000000000006,"d":"46.90"}},{"$f":"'1b. Corrected Inputs Segment'!$D$242","v":15.1},{"$f":"'1b. Corrected Inputs Segment'!$D$241","v":5.8},{"$f":"'1b. Corrected Inputs Segment'!$D$246","v":"Werktagsbetrieb"},{"$f":"'1b. Corrected Inputs Segment'!$D$247","v":260},{"$f":"'1b. Corrected Inputs Segment'!$D$248","v":100},{"$f":"'1b. Corrected Inputs Segment'!$D$249","v":0},{"$f":"'1b. Corrected Inputs Segment'!$D$250","v":1},{"$f":"'1b. Corrected Inputs Segment'!$D$251","v":1},{"$f":"'1b. Corrected Inputs Segment'!$D$252","v":{"v":1,"d":"1.0"}},{"$f":"'1b. Corrected Inputs Segment'!$D$253","v":{"v":8,"d":"8.0"}},{"$f":"'1b. Corrected Inputs Segment'!$D$254","v":{"v":1,"d":"1.0"}},{"$f":"'1b. Corrected Inputs Segment'!$D$262","v":{"v":28810.890000000003,"d":"28,811"}},{"$f":"'1b. Corrected Inputs Segment'!$D$259","v":{"v":27219.464999999997,"d":"27,219"}},{"$f":"'1b. Corrected Inputs Segment'!$D$258","v":{"v":0.03,"d":"3.0%"}},{"$f":"'1b. Corrected Inputs Segment'!$D$257","v":48},{"$f":"'1b. Corrected Inputs Segment'!$D$260","v":{"v":0.05,"d":"0.050"}},{"$f":"'1b. Corrected Inputs Segment'!$D$261","v":{"v":0.31606388888888887,"d":"32%"}},{"$f":"'1b. Corrected Inputs Segment'!$D$263","v":0.025},{"$f":"'1b. Corrected Inputs Segment'!$D$264","v":{"v":0.30658197222222217,"d":"31%"}}]
["Segment H",{"$f":"SUM(F$2:F9)","v":1},{"$f":"SUM(G$2:G9)","v":1},{"$f":"SUM(H$2:H9)","v":0},{"$f":"'1b. Corrected Inputs Segment'!$D$271","v":"Poolfahrzeuge"},{"$f":"'1b. Corrected Inputs Segment'!$D$270","v":0},0,0,{"$f":"'1b. Corrected Inputs Segment'!$D$272","v":"regional"},{"$f":"'1b. Corrected Inputs Segment'!$D$273","v":0},{"$f":"'1b. Corrected Inputs Segment'!$D$276","v":"Mittelklasse"},{"$f":"'1b. Corrected Inputs Segment'!$D$279*'2d. Annahmen'!$G$2","v":{"v":46.900000000000006,"d":"46.90"}},{"$f":"'1b. Corrected Inputs Segment'!$D$278","v":15.1},{"$f":"'1b. Corrected Inputs Segment'!$D$277","v":5.8},{"$f":"'1b. Corrected Inputs Segment'!$D$282","v":"Werktagsbetrieb"},{"$f":"'1b. Corrected Inputs Segment'!$D$283","v":260},{"$f":"'1b. Corrected Inputs Segment'!$D$284","v":100},{"$f":"'1b. Corrected Inputs Segment'!$D$285","v":0},{"$f":"'1b. Corrected Inputs Segment'!$D$286","v":1},{"$f":"'1b. Corrected Inputs Segment'!$D$287","v":1},{"$f":"'1b. Corrected Inputs Segment'!$D$288","v":{"v":1,"d":"1.0"}},{"$f":"'1b. Corrected Inputs Segment'!$D$289","v":{"v":8,"d":"8.0"}},{"$f":"'1b. Corrected Inputs Segment'!$D$290","v":{"v":1,"d":"1.0"}},{"$f":"'1b. Corrected Inputs Segment'!$D$298","v":{"v":28810.890000000003,"d":"28,811"}},{"$f":"'1b. Corrected Inputs Segment'!$D$295","v":{"v":27219.464999999997,"d":"27,219"}},{"$f":"'1b. Corrected Inputs Segment'!$D$294","v":{"v":0.03,"d":"3.0%"}},{"$f":"'1b. Corrected Inputs Segment'!$D$293","v":48},{"$f":"'1b. Corrected Inputs Segment'!$D$296","v":{"v":0.05,"d":"0.050"}},{"$f":"'1b. Corrected Inputs Segment'!$D$297","v":{"v":0.31606388888888887,"d":"32%"}},{"$f":"'1b. Corrected Inputs Segment'!$D$299","v":0.025},{"$f":"'1b. Corrected Inputs Segment'!$D$300","v":{"v":0.30658197222222217,"d":"31%"}}]
["Segment I",{"$f":"SUM(F$2:F10)","v":1},{"$f":"SUM(G$2:G10)","v":1},{"$f":"SUM(H$2:H10)","v":0},{"$f":"'1b. Corrected Inputs Segment'!$D$307","v":"Poolfahrzeuge"},{"$f":"'1b. Corrected Inputs Segment'!$D$306","v":0},0,0,{"$f":"'1b. Corrected Inputs Segment'!$D$308","v":"regional"},{"$f":"'1b. Corrected Inputs Segment'!$D$309","v":0},{"$f":"'1b. Corrected Inputs Segment'!$D$312","v":"Mittelklasse"},{"$f":"'1b. Corrected Inputs Segment'!$D$315*'2d. Annahmen'!$G$2","v":{"v":46.900000000000006,"d":"46.90"}},{"$f":"'1b. Corrected Inputs Segment'!$D$314","v":15.1},{"$f":"'1b. Corrected Inputs Segment'!$D$313","v":5.8},{"$f":"'1b. Corrected Inputs Segment'!$D$318","v":"Werktagsbetrieb"},{"$f":"'1b. Corrected Inputs Segment'!$D$319","v":260},{"$f":"'1b. Corrected Inputs Segment'!$D$320","v":100},{"$f":"'1b. Corrected Inputs Segment'!$D$321","v":0},{"$f":"'1b. Corrected Inputs Segment'!$D$322","v":1},{"$f":"'1b. Corrected Inputs Segment'!$D$323","v":1},{"$f":"'1b. Corrected Inputs Segment'!$D$324","v":{"v":1,"d":"1.0"}},{"$f":"'1b. Corrected Inputs Segment'!$D$325","v":{"v":8,"d":"8.0"}},{"$f":"'1b. Corrected Inputs Segment'!$D$326","v":{"v":1,"d":"1.0"}},{"$f":"'1b. Corrected Inputs Segment'!$D$334","v":{"v":28810.890000000003,"d":"28,811"}},{"$f":"'1b. Corrected Inputs Segment'!$D$331","v":{"v":27219.464999999997,"d":"27,219"}},{"$f":"'1b. Corrected Inputs Segment'!$D$330","v":{"v":0.03,"d":"3.0%"}},{"$f":"'1b. Corrected Inputs Segment'!$D$329","v":48},{"$f":"'1b. Corrected Inputs Segment'!$D$332","v":{"v":0.05,"d":"0.050"}},{"$f":"'1b. Corrected Inputs Segment'!$D$333","v":{"v":0.31606388888888887,"d":"32%"}},{"$f":"'1b. Corrected Inputs Segment'!$D$335","v":0.025},{"$f":"'1b. Corrected Inputs Segment'!$D$336","v":{"v":0.30658197222222217,"d":"31%"}}]
["Segment J",{"$f":"SUM(F$2:F11)","v":1},{"$f":"SUM(G$2:G11)","v":1},{"$f":"SUM(H$2:H11)","v":0},{"$f":"'1b. Corrected Inputs Segment'!$D$343","v":"Poolfahrzeuge"},{"$f":"'1b. Corrected Inputs Segment'!$D$342","v":0},0,0,{"$f":"'1b. Corrected Inputs Segment'!$D$344","v":"regional"},{"$f":"'1b. Corrected Inputs Segment'!$D$345","v":0},{"$f":"'1b. Corrected Inputs Segment'!$D$348","v":"Mittelklasse"},{"$f":"'1b. Corrected Inputs Segment'!$D$351*'2d. Annahmen'!$G$2","v":{"v":46.900000000000006,"d":"46.90"}},{"$f":"'1b. Corrected Inputs Segment'!$D$350","v":15.1},{"$f":"'1b. Corrected Inputs Segment'!$D$349","v":5.8},{"$f":"'1b. Corrected Inputs Segment'!$D$354","v":"Werktagsbetrieb"},{"$f":"'1b. Corrected Inputs Segment'!$D$355","v":260},{"$f":"'1b. Corrected Inputs Segment'!$D$356","v":100},{"$f":"'1b. Corrected Inputs Segment'!$D$357","v":0},{"$f":"'1b. Corrected Inputs Segment'!$D$358","v":1},{"$f":"'1b. Corrected Inputs Segment'!$D$359","v":1},{"$f":"'1b. Corrected Inputs Segment'!$D$360","v":{"v":1,"d":"1.0"}},{"$f":"'1b. Corrected Inputs Segment'!$D$361","v":{"v":8,"d":"8.0"}},{"$f":"'1b. Corrected Inputs Segment'!$D$362","v":{"v":1,"d":"1.0"}},{"$f":"'1b. Corrected Inputs Segment'!$D$370","v":{"v":28810.890000000003,"d":"28,811"}},{"$f":"'1b. Corrected Inputs Segment'!$D$367","v":{"v":27219.464999999997,"d":"27,219"}},{"$f":"'1b. Corrected Inputs Segment'!$D$366","v":{"v":0.03,"d":"3.0%"}},{"$f":"'1b. Corrected Inputs Segment'!$D$365","v":48},{"$f":"'1b. Corrected Inputs Segment'!$D$368","v":{"v":0.05,"d":"0.050"}},{"$f":"'1b. Corrected Inputs Segment'!$D$369","v":{"v":0.31606388888888887,"d":"32%"}},{"$f":"'1b. Corrected Inputs Segment'!$D$371","v":0.025},{"$f":"'1b. Corrected Inputs Segment'!$D$372","v":{"v":0.30658197222222217,"d":"31%"}}]
["Total","Running Sums (above)",{"$nulls":3},{"$f":"SUM(F2:F11)","v":1},{"$f":"SUM(G2:G11)","v":1},{"$f":"SUM(H2:H11)","v":0}]

{"sheet":"1d. Dropdown Lists","index":6,"n_rows":13,"n_cols":19,"rows_kept":13,"hidden":true}
["User",null,"Einsatzart","Einsatzzweck","Einsatzgebiet","Nutzungsmuster",null,"Fahrzeuggrösse",null,"Laufzeit",null,"Ladeleistung (pro LP)",null,null,"Anzahl Segmente",null,null,"Heimladen"]
["Default Werte",null,"Poolfahrzeuge","Aussendienst","regional","Werktagsbetrieb",null,"Kleinwagen","Compact",12,null,11,"AC",null,1,null,null,"Ja",1]
["Eigene Eingaben",null,"Dienstfahrzeuge","Lieferdienst","schweizweit","24/7-Betrieb",null,"Mittelklasse","Medium",24,null,22,"AC",null,2,null,null,"Nein",0]
[{"$nulls":4},"international","Schichtbetrieb",null,"Oberklasse","Large",36,null,50,"DC",null,3]
[{"$nulls":7},"SUV","SUV",48,null,66,"DC",null,4]
[{"$nulls":9},60,null,75,"DC",null,5]
[{"$nulls":9},72,null,100,"DC",null,6]
[{"$nulls":11},120,"DC",null,7]
[{"$nulls":11},150,"DC",null,8]
[{"$nulls":11},180,"DC",null,9]
[{"$nulls":11},200,"DC",null,10]
[{"$nulls":11},225,"DC"]
[{"$nulls":11},250,"DC"]

{"sheet":"1e. Dropdown Values","index":7,"n_rows":10,"n_cols":4,"rows_kept":10,"hidden":true}
["Defaultwerte werden von Dropdownauswahl beeinflusst"]
[]
["Einsatzgebiet",{"$f":"TRANSPOSE(Einsatzgebiet)","v":"regional"},"schweizweit","international"]
["Ø Fahrleistung während der Arbeitszeit (km)",100,200,400]
[]
["Nutzungsmuster",{"$f":"TRANSPOSE(Nutzungsmuster)","v":"Werktagsbetrieb"},"24/7-Betrieb","Schichtbetrieb"]
["Anzahl Werktage",{"$f":"5*52","v":260},{"$f":"360","v":360},260]
["Standzeit (übernacht)",8,0,0]
["Ø Standzeit pro Pause",1,1,1]
["Anzahl Fzg pro LP",1,2,2]

{"sheet":"2. Eingaben Fahrzeug-Ebene","index":8,"n_rows":14,"n_cols":35,"rows_kept":14,"hidden":true,"merged":[[0,1,1,7],[0,8,0,18],[0,19,1,24],[0,25,1,34],[1,8,1,13],[1,14,1,18]]}
["wird ausgeblendet ?","Fahrzeugtyp",{"$nulls":6},"Technische Details",{"$nulls":10},"Fahrleistung",{"$nulls":5},"Ladekonzept"]
[{"$nulls":8},"E-Fahrzeug",{"$nulls":5},"Verbrenner"]
[null,"Used?","Anzahl Fahrzeug","Pool-fahrzeug","Dienst-fahrzeug","Fahrzeug-grösse","Fahrzeug-grösse Index","Laufzeit","Batterie-kapazität (nutzbar)","Energie-verbrauch","Anschaffungs-kosten","Restwert","Endwert","Unterhalts-kosten","Treibstoff-verbrauch","Anschaffungs-kosten","Restwert","Endwert","Unterhalts-kosten","Fahrleistung während der Arbeit","Pendeldistanz  (Hin- und Rückfahrt)","Tägliche Fahrleistung","Anzahl Werktage","Jährliche Fahrleistung","Fahrleistung während der Nutzungsdauer","Anzahl Einsätze","Anzahl Pausen vor 1. Einsatz","Anzahl Pausen am Firmen-standort (tagsüber)","Anzahl Pausen nach letzter Einsatz","Standzeit pro Pause","Standzeit am Firmen-standort (tagsüber)","Standzeit (über Nacht)","Laden am Wohnort (über Nacht) möglich","Laden am Firmen-standort (über Nacht) möglich","Fahrzeuge pro Ladepunkt, Firmenstandort (tagsüber)"]
["Segment","-","-","-","-",null,null,"Monate","kWh","kWh/100 km","CHF","%","CHF","CHF/km","l/100 km","CHF","%","CHF","CHF/km","km","km","km","-","km","km","pro Tag",null,"pro Tag",null,"Stunden","Stunden/Tag","Stunden/Tag","-","-","-"]
["Segment 1",{"$f":"('1c. Inputs Segment Summary'!F2>0)*1","v":1},{"$f":"'1c. Inputs Segment Summary'!F2","v":1},{"$f":"('1c. Inputs Segment Summary'!G2>0)*1","v":1},{"$f":"('1c. Inputs Segment Summary'!H2>0)*1","v":0},{"$f":"IF(B5,'1c. Inputs Segment Summary'!K2,\"\")","v":"Mittelklasse"},{"$f":"IF(B5,_xlfn.XMATCH(F5,Grösse),0)","v":2},{"$f":"IF(B5,'1c. Inputs Segment Summary'!AA2,0)","v":48},{"$f":"IF(B5,'1c. Inputs Segment Summary'!L2,0)","v":{"v":46.900000000000006,"d":"47"}},{"$f":"IF(B5,'1c. Inputs Segment Summary'!M2,0)","v":{"v":15.1,"d":"15"}},{"$f":"IF(B5,'1c. Inputs Segment Summary'!X2,0)","v":{"v":28810.890000000003,"d":"28,811"}},{"$f":"IF(B5,'1c. Inputs Segment Summary'!AE2,0)","v":{"v":0.30658197222222217,"d":"31%"}},{"$f":"K5*L5","v":{"v":8832.8994776775,"d":"8,833"}},{"$f":"IF(B5,'1c. Inputs Segment Summary'!AD2,0)","v":{"v":0.025,"d":"0.03"}},{"$f":"IF(B5,'1c. Inputs Segment Summary'!N2,0)","v":5.8},{"$f":"IF(B5,'1c. Inputs Segment Summary'!Y2,0)","v":{"v":27219.464999999997,"d":"27,219"}},{"$f":"IF(B5,'1c. Inputs Segment Summary'!AC2,0)","v":{"v":0.31606388888888887,"d":"32%"}},{"$f":"P5*Q5","v":{"v":8603.089961374999,"d":"8,603"}},{"$f":"IF(B5,'1c. Inputs Segment Summary'!AB2,0)","v":0.05},{"$f":"IF(B5,'1c. Inputs Segment Summary'!Q2,0)","v":100},{"$f":"IF(B5,'1c. Inputs Segment Summary'!R2,0)","v":0},{"$f":"SUM(T5:U5)","v":100},{"$f":"IF(B5,'1c. Inputs Segment Summary'!P2,0)","v":260},{"$f":"W5*V5","v":{"v":26000,"d":"26,000"}},{"$f":"X5*(H5/12)","v":{"v":104000,"d":"104,000"}},{"$f":"IF(B5,'1c. Inputs Segment Summary'!S2,0)","v":1},{"$f":"1","v":{"v":1,"d":"1.0"}},{"$f":"IF(B5,Z5-1,0)","v":0},{"$f":"0","v":{"v":0,"d":"0.0"}},{"$f":"IF(B5,'1c. Inputs Segment Summary'!U2,0)","v":{"v":1,"d":"1.0"}},{"$f":"SUM(AA5:AC5)*AD5","v":{"v":1,"d":"1.0"}},{"$f":"IF(B5,'1c. Inputs Segment Summary'!V2,0)","v":{"v":8,"d":"8.0"}},{"$f":"IF(B5,$E5*'1c. Inputs Segment Summary'!J2,0)","v":0},{"$f":"1*$D5","v":1},{"$f":"IF(B5,'1c. Inputs Segment Summary'!W2,0)","v":1}]
["Segment 2",{"$f":"('1c. Inputs Segment Summary'!F3>0)*1","v":0},{"$f":"'1c. Inputs Segment Summary'!F3","v":0},{"$f":"('1c. Inputs Segment Summary'!G3>0)*1","v":0},{"$f":"('1c. Inputs Segment Summary'!H3>0)*1","v":0},{"$f":"IF(B6,'1c. Inputs Segment Summary'!K3,\"\")","v":""},0,{"$f":"IF(B6,'1c. Inputs Segment Summary'!AA3,0)","v":0},{"$f":"IF(B6,'1c. Inputs Segment Summary'!L3,0)","v":0},{"$f":"IF(B6,'1c. Inputs Segment Summary'!M3,0)","v":0},{"$f":"IF(B6,'1c. Inputs Segment Summary'!X3,0)","v":0},{"$f":"IF(B6,'1c. Inputs Segment Summary'!AE3,0)","v":{"v":0,"d":"0%"}},{"$f":"K6*L6","v":0},{"$f":"IF(B6,'1c. Inputs Segment Summary'!AD3,0)","v":{"v":0,"d":"0.00"}},{"$f":"IF(B6,'1c. Inputs Segment Summary'!N3,0)","v":{"v":0,"d":"0.0"}},{"$f":"IF(B6,'1c. Inputs Segment Summary'!Y3,0)","v":0},{"$f":"IF(B6,'1c. Inputs Segment Summary'!AC3,0)","v":{"v":0,"d":"0%"}},{"$f":"P6*Q6","v":0},{"$f":"IF(B6,'1c. Inputs Segment Summary'!AB3,0)","v":{"v":0,"d":"0.00"}},{"$f":"IF(B6,'1c. Inputs Segment Summary'!Q3,0)","v":0},{"$f":"IF(B6,'1c. Inputs Segment Summary'!R3,0)","v":0},{"$f":"SUM(T6:U6)","v":0},{"$f":"IF(B6,'1c. Inputs Segment Summary'!P3,0)","v":0},{"$f":"W6*V6","v":0},{"$f":"X6*(H6/12)","v":0},{"$f":"IF(B6,'1c. Inputs Segment Summary'!S3,0)","v":0},{"$f":"1","v":{"v":1,"d":"1.0"}},0,{"$f":"0","v":{"v":0,"d":"0.0"}},{"$f":"IF(B6,'1c. Inputs Segment Summary'!U3,0)","v":{"v":0,"d":"0.0"}},{"$f":"SUM(AA6:AC6)*AD6","v":{"v":0,"d":"0.0"}},{"$f":"IF(B6,'1c. Inputs Segment Summary'!V3,0)","v":{"v":0,"d":"0.0"}},{"$f":"IF(B6,$E6*'1c. Inputs Segment Summary'!J3,0)","v":0},{"$f":"1*$D6","v":0},{"$f":"IF(B6,'1c. Inputs Segment Summary'!W3,0)","v":0}]
["Segment 3",{"$f":"('1c. Inputs Segment Summary'!F4>0)*1","v":0},{"$f":"'1c. Inputs Segment Summary'!F4","v":0},{"$f":"('1c. Inputs Segment Summary'!G4>0)*1","v":0},{"$f":"('1c. Inputs Segment Summary'!H4>0)*1","v":0},{"$f":"IF(B7,'1c. Inputs Segment Summary'!K4,\"\")","v":""},0,{"$f":"IF(B7,'1c. Inputs Segment Summary'!AA4,0)","v":0},{"$f":"IF(B7,'1c. Inputs Segment Summary'!L4,0)","v":0},{"$f":"IF(B7,'1c. Inputs Segment Summary'!M4,0)","v":0},{"$f":"IF(B7,'1c. Inputs Segment Summary'!X4,0)","v":0},{"$f":"IF(B7,'1c. Inputs Segment Summary'!AE4,0)","v":{"v":0,"d":"0%"}},0,{"$f":"IF(B7,'1c. Inputs Segment Summary'!AD4,0)","v":{"v":0,"d":"0.00"}},{"$f":"IF(B7,'1c. Inputs Segment Summary'!N4,0)","v":{"v":0,"d":"0.0"}},{"$f":"IF(B7,'1c. Inputs Segment Summary'!Y4,0)","v":0},{"$f":"IF(B7,'1c. Inputs Segment Summary'!AC4,0)","v":{"v":0,"d":"0%"}},0,{"$f":"IF(B7,'1c. Inputs Segment Summary'!AB4,0)","v":{"v":0,"d":"0.00"}},{"$f":"IF(B7,'1c. Inputs Segment Summary'!Q4,0)","v":0},{"$f":"IF(B7,'1c. Inputs Segment Summary'!R4,0)","v":0},0,{"$f":"IF(B7,'1c. Inputs Segment Summary'!P4,0)","v":0},0,0,{"$f":"IF(B7,'1c. Inputs Segment Summary'!S4,0)","v":0},{"$f":"1","v":{"v":1,"d":"1.0"}},0,{"$f":"0","v":{"v":0,"d":"0.0"}},{"$f":"IF(B7,'1c. Inputs Segment Summary'!U4,0)","v":{"v":0,"d":"0.0"}},{"v":0,"d":"0.0"},{"$f":"IF(B7,'1c. Inputs Segment Summary'!V4,0)","v":{"v":0,"d":"0.0"}},{"$f":"IF(B7,$E7*'1c. Inputs Segment Summary'!J4,0)","v":0},0,{"$f":"IF(B7,'1c. Inputs Segment Summary'!W4,0)","v":0}]
["Segment 4",{"$f":"('1c. Inputs Segment Summary'!F5>0)*1","v":0},{"$f":"'1c. Inputs Segment Summary'!F5","v":0},{"$f":"('1c. Inputs Segment Summary'!G5>0)*1","v":0},{"$f":"('1c. Inputs Segment Summary'!H5>0)*1","v":0},{"$f":"IF(B8,'1c. Inputs Segment Summary'!K5,\"\")","v":""},0,{"$f":"IF(B8,'1c. Inputs Segment Summary'!AA5,0)","v":0},{"$f":"IF(B8,'1c. Inputs Segment Summary'!L5,0)","v":0},{"$f":"IF(B8,'1c. Inputs Segment Summary'!M5,0)","v":0},{"$f":"IF(B8,'1c. Inputs Segment Summary'!X5,0)","v":0},{"$f":"IF(B8,'1c. Inputs Segment Summary'!AE5,0)","v":{"v":0,"d":"0%"}},0,{"$f":"IF(B8,'1c. Inputs Segment Summary'!AD5,0)","v":{"v":0,"d":"0.00"}},{"$f":"IF(B8,'1c. Inputs Segment Summary'!N5,0)","v":{"v":0,"d":"0.0"}},{"$f":"IF(B8,'1c. Inputs Segment Summary'!Y5,0)","v":0},{"$f":"IF(B8,'1c. Inputs Segment Summary'!AC5,0)","v":{"v":0,"d":"0%"}},0,{"$f":"IF(B8,'1c. Inputs Segment Summary'!AB5,0)","v":{"v":0,"d":"0.00"}},{"$f":"IF(B8,'1c. Inputs Segment Summary'!Q5,0)","v":0},{"$f":"IF(B8,'1c. Inputs Segment Summary'!R5,0)","v":0},0,{"$f":"IF(B8,'1c. Inputs Segment Summary'!P5,0)","v":0},0,0,{"$f":"IF(B8,'1c. Inputs Segment Summary'!S5,0)","v":0},{"$f":"1","v":{"v":1,"d":"1.0"}},0,{"$f":"0","v":{"v":0,"d":"0.0"}},{"$f":"IF(B8,'1c. Inputs Segment Summary'!U5,0)","v":{"v":0,"d":"0.0"}},{"v":0,"d":"0.0"},{"$f":"IF(B8,'1c. Inputs Segment Summary'!V5,0)","v":{"v":0,"d":"0.0"}},{"$f":"IF(B8,$E8*'1c. Inputs Segment Summary'!J5,0)","v":0},0,{"$f":"IF(B8,'1c. Inputs Segment Summary'!W5,0)","v":0}]
["Segment 5",{"$f":"('1c. Inputs Segment Summary'!F6>0)*1","v":0},{"$f":"'1c. Inputs Segment Summary'!F6","v":0},{"$f":"('1c. Inputs Segment Summary'!G6>0)*1","v":0},{"$f":"('1c. Inputs Segment Summary'!H6>0)*1","v":0},{"$f":"IF(B9,'1c. Inputs Segment Summary'!K6,\"\")","v":""},0,{"$f":"IF(B9,'1c. Inputs Segment Summary'!AA6,0)","v":0},{"$f":"IF(B9,'1c. Inputs Segment Summary'!L6,0)","v":0},{"$f":"IF(B9,'1c. Inputs Segment Summary'!M6,0)","v":0},{"$f":"IF(B9,'1c. Inputs Segment Summary'!X6,0)","v":0},{"$f":"IF(B9,'1c. Inputs Segment Summary'!AE6,0)","v":{"v":0,"d":"0%"}},0,{"$f":"IF(B9,'1c. Inputs Segment Summary'!AD6,0)","v":{"v":0,"d":"0.00"}},{"$f":"IF(B9,'1c. Inputs Segment Summary'!N6,0)","v":{"v":0,"d":"0.0"}},{"$f":"IF(B9,'1c. Inputs Segment Summary'!Y6,0)","v":0},{"$f":"IF(B9,'1c. Inputs Segment Summary'!AC6,0)","v":{"v":0,"d":"0%"}},0,{"$f":"IF(B9,'1c. Inputs Segment Summary'!AB6,0)","v":{"v":0,"d":"0.00"}},{"$f":"IF(B9,'1c. Inputs Segment Summary'!Q6,0)","v":0},{"$f":"IF(B9,'1c. Inputs Segment Summary'!R6,0)","v":0},0,{"$f":"IF(B9,'1c. Inputs Segment Summary'!P6,0)","v":0},0,0,{"$f":"IF(B9,'1c. Inputs Segment Summary'!S6,0)","v":0},{"$f":"1","v":{"v":1,"d":"1.0"}},0,{"$f":"0","v":{"v":0,"d":"0.0"}},{"$f":"IF(B9,'1c. Inputs Segment Summary'!U6,0)","v":{"v":0,"d":"0.0"}},{"v":0,"d":"0.0"},{"$f":"IF(B9,'1c. Inputs Segment Summary'!V6,0)","v":{"v":0,"d":"0.0"}},{"$f":"IF(B9,$E9*'1c. Inputs Segment Summary'!J6,0)","v":0},0,{"$f":"IF(B9,'1c. Inputs Segment Summary'!W6,0)","v":0}]
["Segment 6",{"$f":"('1c. Inputs Segment Summary'!F7>0)*1","v":0},{"$f":"'1c. Inputs Segment Summary'!F7","v":0},{"$f":"('1c. Inputs Segment Summary'!G7>0)*1","v":0},{"$f":"('1c. Inputs Segment Summary'!H7>0)*1","v":0},{"$f":"IF(B10,'1c. Inputs Segment Summary'!K7,\"\")","v":""},0,{"$f":"IF(B10,'1c. Inputs Segment Summary'!AA7,0)","v":0},{"$f":"IF(B10,'1c. Inputs Segment Summary'!L7,0)","v":0},{"$f":"IF(B10,'1c. Inputs Segment Summary'!M7,0)","v":0},{"$f":"IF(B10,'1c. Inputs Segment Summary'!X7,0)","v":0},{"$f":"IF(B10,'1c. Inputs Segment Summary'!AE7,0)","v":{"v":0,"d":"0%"}},0,{"$f":"IF(B10,'1c. Inputs Segment Summary'!AD7,0)","v":{"v":0,"d":"0.00"}},{"$f":"IF(B10,'1c. Inputs Segment Summary'!N7,0)","v":{"v":0,"d":"0.0"}},{"$f":"IF(B10,'1c. Inputs Segment Summary'!Y7,0)","v":0},{"$f":"IF(B10,'1c. Inputs Segment Summary'!AC7,0)","v":{"v":0,"d":"0%"}},0,{"$f":"IF(B10,'1c. Inputs Segment Summary'!AB7,0)","v":{"v":0,"d":"0.00"}},{"$f":"IF(B10,'1c. Inputs Segment Summary'!Q7,0)","v":0},{"$f":"IF(B10,'1c. Inputs Segment Summary'!R7,0)","v":0},0,{"$f":"IF(B10,'1c. Inputs Segment Summary'!P7,0)","v":0},0,0,{"$f":"IF(B10,'1c. Inputs Segment Summary'!S7,0)","v":0},{"$f":"1","v":{"v":1,"d":"1.0"}},0,{"$f":"0","v":{"v":0,"d":"0.0"}},{"$f":"IF(B10,'1c. Inputs Segment Summary'!U7,0)","v":{"v":0,"d":"0.0"}},{"v":0,"d":"0.0"},{"$f":"IF(B10,'1c. Inputs Segment Summary'!V7,0)","v":{"v":0,"d":"0.0"}},{"$f":"IF(B10,$E10*'1c. Inputs Segment Summary'!J7,0)","v":0},0,{"$f":"IF(B10,'1c. Inputs Segment Summary'!W7,0)","v":0}]
["Segment 7",{"$f":"('1c. Inputs Segment Summary'!F8>0)*1","v":0},{"$f":"'1c. Inputs Segment Summary'!F8","v":0},{"$f":"('1c. Inputs Segment Summary'!G8>0)*1","v":0},{"$f":"('1c. Inputs Segment Summary'!H8>0)*1","v":0},{"$f":"IF(B11,'1c. Inputs Segment Summary'!K8,\"\")","v":""},0,{"$f":"IF(B11,'1c. Inputs Segment Summary'!AA8,0)","v":0},{"$f":"IF(B11,'1c. Inputs Segment Summary'!L8,0)","v":0},{"$f":"IF(B11,'1c. Inputs Segment Summary'!M8,0)","v":0},{"$f":"IF(B11,'1c. Inputs Segment Summary'!X8,0)","v":0},{"$f":"IF(B11,'1c. Inputs Segment Summary'!AE8,0)","v":{"v":0,"d":"0%"}},0,{"$f":"IF(B11,'1c. Inputs Segment Summary'!AD8,0)","v":{"v":0,"d":"0.00"}},{"$f":"IF(B11,'1c. Inputs Segment Summary'!N8,0)","v":{"v":0,"d":"0.0"}},{"$f":"IF(B11,'1c. Inputs Segment Summary'!Y8,0)","v":0},{"$f":"IF(B11,'1c. Inputs Segment Summary'!AC8,0)","v":{"v":0,"d":"0%"}},0,{"$f":"IF(B11,'1c. Inputs Segment Summary'!AB8,0)","v":{"v":0,"d":"0.00"}},{"$f":"IF(B11,'1c. Inputs Segment Summary'!Q8,0)","v":0},{"$f":"IF(B11,'1c. Inputs Segment Summary'!R8,0)","v":0},0,{"$f":"IF(B11,'1c. Inputs Segment Summary'!P8,0)","v":0},0,0,{"$f":"IF(B11,'1c. Inputs Segment Summary'!S8,0)","v":0},{"$f":"1","v":{"v":1,"d":"1.0"}},0,{"$f":"0","v":{"v":0,"d":"0.0"}},{"$f":"IF(B11,'1c. Inputs Segment Summary'!U8,0)","v":{"v":0,"d":"0.0"}},{"v":0,"d":"0.0"},{"$f":"IF(B11,'1c. Inputs Segment Summary'!V8,0)","v":{"v":0,"d":"0.0"}},{"$f":"IF(B11,$E11*'1c. Inputs Segment Summary'!J8,0)","v":0},0,{"$f":"IF(B11,'1c. Inputs Segment Summary'!W8,0)","v":0}]
["Segment 8",{"$f":"('1c. Inputs Segment Summary'!F9>0)*1","v":0},{"$f":"'1c. Inputs Segment Summary'!F9","v":0},{"$f":"('1c. Inputs Segment Summary'!G9>0)*1","v":0},{"$f":"('1c. Inputs Segment Summary'!H9>0)*1","v":0},{"$f":"IF(B12,'1c. Inputs Segment Summary'!K9,\"\")","v":""},0,{"$f":"IF(B12,'1c. Inputs Segment Summary'!AA9,0)","v":0},{"$f":"IF(B12,'1c. Inputs Segment Summary'!L9,0)","v":0},{"$f":"IF(B12,'1c. Inputs Segment Summary'!M9,0)","v":0},{"$f":"IF(B12,'1c. Inputs Segment Summary'!X9,0)","v":0},{"$f":"IF(B12,'1c. Inputs Segment Summary'!AE9,0)","v":{"v":0,"d":"0%"}},0,{"$f":"IF(B12,'1c. Inputs Segment Summary'!AD9,0)","v":{"v":0,"d":"0.00"}},{"$f":"IF(B12,'1c. Inputs Segment Summary'!N9,0)","v":{"v":0,"d":"0.0"}},{"$f":"IF(B12,'1c. Inputs Segment Summary'!Y9,0)","v":0},{"$f":"IF(B12,'1c. Inputs Segment Summary'!AC9,0)","v":{"v":0,"d":"0%"}},0,{"$f":"IF(B12,'1c. Inputs Segment Summary'!AB9,0)","v":{"v":0,"d":"0.00"}},{"$f":"IF(B12,'1c. Inputs Segment Summary'!Q9,0)","v":0},{"$f":"IF(B12,'1c. Inputs Segment Summary'!R9,0)","v":0},0,{"$f":"IF(B12,'1c. Inputs Segment Summary'!P9,0)","v":0},0,0,{"$f":"IF(B12,'1c. Inputs Segment Summary'!S9,0)","v":0},{"$f":"1","v":{"v":1,"d":"1.0"}},0,{"$f":"0","v":{"v":0,"d":"0.0"}},{"$f":"IF(B12,'1c. Inputs Segment Summary'!U9,0)","v":{"v":0,"d":"0.0"}},{"v":0,"d":"0.0"},{"$f":"IF(B12,'1c. Inputs Segment Summary'!V9,0)","v":{"v":0,"d":"0.0"}},{"$f":"IF(B12,$E12*'1c. Inputs Segment Summary'!J9,0)","v":0},0,{"$f":"IF(B12,'1c. Inputs Segment Summary'!W9,0)","v":0}]
["Segment 9",{"$f":"('1c. Inputs Segment Summary'!F10>0)*1","v":0},{"$f":"'1c. Inputs Segment Summary'!F10","v":0},{"$f":"('1c. Inputs Segment Summary'!G10>0)*1","v":0},{"$f":"('1c. Inputs Segment Summary'!H10>0)*1","v":0},{"$f":"IF(B13,'1c. Inputs Segment Summary'!K10,\"\")","v":""},0,{"$f":"IF(B13,'1c. Inputs Segment Summary'!AA10,0)","v":0},{"$f":"IF(B13,'1c. Inputs Segment Summary'!L10,0)","v":0},{"$f":"IF(B13,'1c. Inputs Segment Summary'!M10,0)","v":0},{"$f":"IF(B13,'1c. Inputs Segment Summary'!X10,0)","v":0},{"$f":"IF(B13,'1c. Inputs Segment Summary'!AE10,0)","v":{"v":0,"d":"0%"}},0,{"$f":"IF(B13,'1c. Inputs Segment Summary'!AD10,0)","v":{"v":0,"d":"0.00"}},{"$f":"IF(B13,'1c. Inputs Segment Summary'!N10,0)","v":{"v":0,"d":"0.0"}},{"$f":"IF(B13,'1c. Inputs Segment Summary'!Y10,0)","v":0},{"$f":"IF(B13,'1c. Inputs Segment Summary'!AC10,0)","v":{"v":0,"d":"0%"}},0,{"$f":"IF(B13,'1c. Inputs Segment Summary'!AB10,0)","v":{"v":0,"d":"0.00"}},{"$f":"IF(B13,'1c. Inputs Segment Summary'!Q10,0)","v":0},{"$f":"IF(B13,'1c. Inputs Segment Summary'!R10,0)","v":0},0,{"$f":"IF(B13,'1c. Inputs Segment Summary'!P10,0)","v":0},0,0,{"$f":"IF(B13,'1c. Inputs Segment Summary'!S10,0)","v":0},{"$f":"1","v":{"v":1,"d":"1.0"}},0,{"$f":"0","v":{"v":0,"d":"0.0"}},{"$f":"IF(B13,'1c. Inputs Segment Summary'!U10,0)","v":{"v":0,"d":"0.0"}},{"v":0,"d":"0.0"},{"$f":"IF(B13,'1c. Inputs Segment Summary'!V10,0)","v":{"v":0,"d":"0.0"}},{"$f":"IF(B13,$E13*'1c. Inputs Segment Summary'!J10,0)","v":0},0,{"$f":"IF(B13,'1c. Inputs Segment Summary'!W10,0)","v":0}]
["Segment 10",{"$f":"('1c. Inputs Segment Summary'!F11>0)*1","v":0},{"$f":"'1c. Inputs Segment Summary'!F11","v":0},{"$f":"('1c. Inputs Segment Summary'!G11>0)*1","v":0},{"$f":"('1c. Inputs Segment Summary'!H11>0)*1","v":0},{"$f":"IF(B14,'1c. Inputs Segment Summary'!K11,\"\")","v":""},0,{"$f":"IF(B14,'1c. Inputs Segment Summary'!AA11,0)","v":0},{"$f":"IF(B14,'1c. Inputs Segment Summary'!L11,0)","v":0},{"$f":"IF(B14,'1c. Inputs Segment Summary'!M11,0)","v":0},{"$f":"IF(B14,'1c. Inputs Segment Summary'!X11,0)","v":0},{"$f":"IF(B14,'1c. Inputs Segment Summary'!AE11,0)","v":{"v":0,"d":"0%"}},0,{"$f":"IF(B14,'1c. Inputs Segment Summary'!AD11,0)","v":{"v":0,"d":"0.00"}},{"$f":"IF(B14,'1c. Inputs Segment Summary'!N11,0)","v":{"v":0,"d":"0.0"}},{"$f":"IF(B14,'1c. Inputs Segment Summary'!Y11,0)","v":0},{"$f":"IF(B14,'1c. Inputs Segment Summary'!AC11,0)","v":{"v":0,"d":"0%"}},0,{"$f":"IF(B14,'1c. Inputs Segment Summary'!AB11,0)","v":{"v":0,"d":"0.00"}},{"$f":"IF(B14,'1c. Inputs Segment Summary'!Q11,0)","v":0},{"$f":"IF(B14,'1c. Inputs Segment Summary'!R11,0)","v":0},0,{"$f":"IF(B14,'1c. Inputs Segment Summary'!P11,0)","v":0},0,0,{"$f":"IF(B14,'1c. Inputs Segment Summary'!S11,0)","v":0},{"$f":"1","v":{"v":1,"d":"1.0"}},0,{"$f":"0","v":{"v":0,"d":"0.0"}},{"$f":"IF(B14,'1c. Inputs Segment Summary'!U11,0)","v":{"v":0,"d":"0.0"}},{"v":0,"d":"0.0"},{"$f":"IF(B14,'1c. Inputs Segment Summary'!V11,0)","v":{"v":0,"d":"0.0"}},{"$f":"IF(B14,$E14*'1c. Inputs Segment Summary'!J11,0)","v":0},0,{"$f":"IF(B14,'1c. Inputs Segment Summary'!W11,0)","v":0}]

{"sheet":"2a. Ladekonzept","index":9,"n_rows":14,"n_cols":47,"rows_kept":14,"hidden":true,"merged":[[1,3,1,6],[1,7,1,9],[1,10,1,13],[1,14,1,17],[1,18,1,20],[1,22,1,34],[1,35,1,45]]}
["Arbeitsblatt wird ausgeblendet",{"$nulls":25},"Quelle: SIA 2060",{"$nulls":6},"Quelle: SIA 2060"]
[{"$nulls":3},"Verbrauch",{"$nulls":3},"Trips",null,null,"Max. Energiemenge (inkl. Verlust Fzg -> Batterie)",{"$nulls":3},"öffentliches Laden",{"$nulls":3},"Wohnort / Firmenstandort Laden",null,null,"LIS Wohnort","Ladeinfrastruktur Firmenstandort",{"$nulls":12},"Check"]
["Segment","In Use?","Anzahl Fahrzeug","Verbrauch","Verbrauch (Arbeitszeit)","Verbrauch (Arbeitszeit, pro Einsatz)","Verbrauch (Pendeln, einfache Fahrt)","Pendeln","Einsätze","Pendeln","Heimladen","Firmenstandort (über Nacht)","Firmenstandort (tagsüber, pro Pause)","Firmenstandort (tagsüber, total)","öffentlich (fehlende Reichweite)","öffentlich (Ladeleistung begrenzt)","öffentlich (total)","öffentliches Laden nötig","Heimladen","Firmenstandort (über Nacht)","Firmenstandort (tagsüber, total)","Anzahl LP (Wohnort)","Fzg pro LP (über Nacht)","Anzahl LP (über Nacht)","Ø Nennleistung (über Nacht)","Gerundete Nennleistung (über Nacht)","Gleichzeitigkeits-faktor (über Nacht)","Anschlussleistung (über Nacht)","Fzg pro LP (tagsüber)","Anzahl LP (tagsüber)","Ø Nennleistung (tagsüber)","Gerundete Nenn-leistung (tagsüber)","Ladevorgänge (tagsüber)","Gleichzeitigkeits-faktor (tagsüber)","Anschlussleistung (tagsüber)","Firmenstandort (tagsüber, pro Pause)","Batterie Stand Tagesbeginn","öffentlich (Pendeln)","Batterie Stand vor 1. Einsatz","öffentlich (Andere Einsätze)","Batterie Stand vor letzter Einsatz","öffentlich (Pendeln)","Batterie Stand Tagesende","CHECK öff. Ladebedarf","CHECK Ladebedarf","CHECK Stand Tagesende"]
[{"$nulls":3},"kWh/Tag","kWh","kWh","kWh","kWh","kWh","kWh","kWh","kWh","kWh","kWh","kWh","kWh","kWh","-","kWh","kWh","kWh","-",null,"-","kW","kW",{"$nulls":3},"-","kW","kW","-",null,null,"kWh"]
["Segment 1",{"$f":"'2. Eingaben Fahrzeug-Ebene'!B5*(SUM('2. Eingaben Fahrzeug-Ebene'!D5:E5)>0)","v":1},{"$f":"'2. Eingaben Fahrzeug-Ebene'!C5","v":1},{"$f":"'2. Eingaben Fahrzeug-Ebene'!V5*'2. Eingaben Fahrzeug-Ebene'!$J5/100","v":{"v":15.1,"d":"15"}},{"$f":"'2. Eingaben Fahrzeug-Ebene'!T5*'2. Eingaben Fahrzeug-Ebene'!$J5/100","v":{"v":15.1,"d":"15"}},{"$f":"IF(B5,E5/'2. Eingaben Fahrzeug-Ebene'!Z5,0)","v":{"v":15.1,"d":"15"}},{"$f":"'2. Eingaben Fahrzeug-Ebene'!U5*'2. Eingaben Fahrzeug-Ebene'!$J5/100/2","v":0},{"$f":"G5","v":0},{"$f":"F5","v":{"v":15.1,"d":"15"}},{"$f":"G5","v":0},{"$f":"MIN('2. Eingaben Fahrzeug-Ebene'!AG5*'1b. Corrected Inputs Segment'!$J$24*'2. Eingaben Fahrzeug-Ebene'!AF5*'2d. Annahmen'!$B$57,'2. Eingaben Fahrzeug-Ebene'!I5)","v":0},{"$f":"MIN('2. Eingaben Fahrzeug-Ebene'!AH5*'1b. Corrected Inputs Segment'!$J$25*'2. Eingaben Fahrzeug-Ebene'!AF5*'2d. Annahmen'!$B$57,'2. Eingaben Fahrzeug-Ebene'!I5)","v":{"v":46.900000000000006,"d":"47"}},{"$f":"MIN('1b. Corrected Inputs Segment'!$J$26*'2. Eingaben Fahrzeug-Ebene'!AD5*'2d. Annahmen'!$B$57,'2. Eingaben Fahrzeug-Ebene'!I5)","v":{"v":46.900000000000006,"d":"47"}},{"$f":"M5*SUM('2. Eingaben Fahrzeug-Ebene'!AA5:AC5)","v":{"v":46.900000000000006,"d":"47"}},{"$f":"SUM(MAX(H5-'2. Eingaben Fahrzeug-Ebene'!I5,0),MAX(('2. Eingaben Fahrzeug-Ebene'!Z5)*(I5-'2. Eingaben Fahrzeug-Ebene'!I5),0),MAX(J5-'2. Eingaben Fahrzeug-Ebene'!I5,0))","v":0},{"$f":"MAX(D5-SUM(K5:L5,N5),0)","v":0},{"$f":"MAX(O5:P5)","v":0},{"$f":"(Q5>0)*1","v":0},{"$f":"MIN(D5,K5)","v":0},{"$f":"MIN(D5,L5)","v":{"v":15.1,"d":"15"}},{"$f":"D5-SUM(S5:T5,Q5)","v":0},{"$f":"(S5>0)*1/'1b. Corrected Inputs Segment'!$J$28","v":0},{"$f":"'1b. Corrected Inputs Segment'!$J$29","v":1},{"$f":"(T5>0)/W5","v":1},{"$f":"IF(T5>0,T5/'2. Eingaben Fahrzeug-Ebene'!AF5/'2d. Annahmen'!$B$57,0)","v":{"v":1.986842105263158,"d":"2"}},{"$f":"IF(Y5>0,MIN(MIN(_xlfn._xlws.FILTER(Ladeleistung,(Ladeleistung>=Y5))),'1b. Corrected Inputs Segment'!$J$25),0)","v":11},{"$f":"IFERROR(0.8/(SUM('3a. Detailierte Ergebnisse'!$T$24:$U$24)^0.401),1)","v":{"v":0.8,"d":"0.80"}},{"$f":"MAX(X5*Y5,X5*'1b. Corrected Inputs Segment'!$J$25*AA5)","v":{"v":8.8,"d":"9"}},{"$f":"'2. Eingaben Fahrzeug-Ebene'!AI5","v":1},{"$f":"IF(B5,(U5>0)/AC5,0)","v":0},{"$f":"IF(U5>0,MIN('1b. Corrected Inputs Segment'!$J$26,U5/'2. Eingaben Fahrzeug-Ebene'!AE5/'2d. Annahmen'!$B$57),0)","v":0},{"$f":"IF(AE5>0,MIN(_xlfn._xlws.FILTER(Ladeleistung,(Ladeleistung>=AE5))),0)","v":0},{"$f":"IF(B5,ROUNDUP(U5/'2. Eingaben Fahrzeug-Ebene'!I5,0),0)","v":0},{"$f":"_xlfn.LET(_xlpm.nS,'3a. Detailierte Ergebnisse'!$E$24,_xlpm.nM,'3a. Detailierte Ergebnisse'!$F$24,_xlpm.nL,'3a. Detailierte Ergebnisse'!$G$24,_xlpm.n,_xlpm.nS+_xlpm.nM+_xlpm.nL,IF(AF5<=100,IF(_xlpm.n<=3,1,1.119/(_xlpm.n^0.094)),IF(AF5<=150,IF(_xlpm.n<=3,1,1.226/(_xlpm.n^0.164)),IF(_xlpm.n=1,1,1.111/(_xlpm.n^0.192)))))","v":{"v":1,"d":"1.00"}},{"$f":"IF(B5,MAX(AD5*AE5/'2d. Annahmen'!$B$56,AD5*AF5*AH5/'2d. Annahmen'!$B$56),0)","v":0},{"$f":"IF(SUM('2. Eingaben Fahrzeug-Ebene'!AA5:AC5)>0,U5/SUM('2. Eingaben Fahrzeug-Ebene'!AA5:AC5),0)","v":0},{"$f":"SUM(S5:T5)+MAX(U5-SUM(E5,J5),0)","v":{"v":15.1,"d":"15"}},{"$f":"IF('2. Eingaben Fahrzeug-Ebene'!E5,MAX(H5-AK5,0),MAX(H5-AK5,0))","v":0},{"$f":"AK5+AL5-H5+'2. Eingaben Fahrzeug-Ebene'!AA5*AJ5","v":{"v":15.1,"d":"15"}},{"$f":"-MIN(AM5+'2. Eingaben Fahrzeug-Ebene'!AB5*AJ5-'2. Eingaben Fahrzeug-Ebene'!Z5*I5,0)","v":0},{"$f":"AM5+AN5+'2. Eingaben Fahrzeug-Ebene'!AC5*AJ5-'2. Eingaben Fahrzeug-Ebene'!Z5*I5+'2. Eingaben Fahrzeug-Ebene'!AB5*AJ5","v":0},{"$f":"MAX(J5-AO5,0)","v":0},{"$f":"AO5+AP5-J5","v":0},{"$f":"ABS(SUM(AL5+AN5+AP5)-Q5)<0.0001","v":true},{"$f":"ABS(SUM(S5:U5,Q5)-D5)<0.0001","v":true},{"$f":"ABS(AQ5-(AK5-SUM(S5:T5)))<0.0001","v":true},{"$f":"\"\"","v":""}]
["Segment 2",{"$f":"'2. Eingaben Fahrzeug-Ebene'!B6*(SUM('2. Eingaben Fahrzeug-Ebene'!D6:E6)>0)","v":0},{"$f":"'2. Eingaben Fahrzeug-Ebene'!C6","v":0},{"$f":"'2. Eingaben Fahrzeug-Ebene'!V6*'2. Eingaben Fahrzeug-Ebene'!$J6/100","v":0},{"$f":"'2. Eingaben Fahrzeug-Ebene'!T6*'2. Eingaben Fahrzeug-Ebene'!$J6/100","v":0},{"$f":"IF(B6,E6/'2. Eingaben Fahrzeug-Ebene'!Z6,0)","v":0},{"$f":"'2. Eingaben Fahrzeug-Ebene'!U6*'2. Eingaben Fahrzeug-Ebene'!$J6/100/2","v":0},{"$f":"G6","v":0},{"$f":"F6","v":0},{"$f":"G6","v":0},{"$f":"MIN('2. Eingaben Fahrzeug-Ebene'!AG6*'1b. Corrected Inputs Segment'!$J$24*'2. Eingaben Fahrzeug-Ebene'!AF6*'2d. Annahmen'!$B$57,'2. Eingaben Fahrzeug-Ebene'!I6)","v":0},{"$f":"MIN('2. Eingaben Fahrzeug-Ebene'!AH6*'1b. Corrected Inputs Segment'!$J$25*'2. Eingaben Fahrzeug-Ebene'!AF6*'2d. Annahmen'!$B$57,'2. Eingaben Fahrzeug-Ebene'!I6)","v":0},{"$f":"MIN('1b. Corrected Inputs Segment'!$J$26*'2. Eingaben Fahrzeug-Ebene'!AD6*'2d. Annahmen'!$B$57,'2. Eingaben Fahrzeug-Ebene'!I6)","v":0},{"$f":"M6*SUM('2. Eingaben Fahrzeug-Ebene'!AA6:AC6)","v":0},{"$f":"SUM(MAX(H6-'2. Eingaben Fahrzeug-Ebene'!I6,0),MAX(('2. Eingaben Fahrzeug-Ebene'!Z6)*(I6-'2. Eingaben Fahrzeug-Ebene'!I6),0),MAX(J6-'2. Eingaben Fahrzeug-Ebene'!I6,0))","v":0},{"$f":"MAX(D6-SUM(K6:L6,N6),0)","v":0},{"$f":"MAX(O6:P6)","v":0},{"$f":"(Q6>0)*1","v":0},{"$f":"MIN(D6,K6)","v":0},{"$f":"MIN(D6,L6)","v":0},{"$f":"D6-SUM(S6:T6,Q6)","v":0},{"$f":"(S6>0)*1/'1b. Corrected Inputs Segment'!$J$28","v":0},{"$f":"'1b. Corrected Inputs Segment'!$J$29","v":1},{"$f":"(T6>0)/W6","v":0},{"$f":"IF(T6>0,T6/'2. Eingaben Fahrzeug-Ebene'!AF6/'2d. Annahmen'!$B$57,0)","v":0},{"$f":"IF(Y6>0,MIN(MIN(_xlfn._xlws.FILTER(Ladeleistung,(Ladeleistung>=Y6))),'1b. Corrected Inputs Segment'!$J$25),0)","v":0},{"$f":"IFERROR(0.8/(SUM('3a. Detailierte Ergebnisse'!$T$24:$U$24)^0.401),1)","v":{"v":0.8,"d":"0.80"}},{"$f":"MAX(X6*Y6,X6*'1b. Corrected Inputs Segment'!$J$25*AA6)","v":0},{"$f":"'2. Eingaben Fahrzeug-Ebene'!AI6","v":0},{"$f":"IF(B6,(U6>0)/AC6,0)","v":0},{"$f":"IF(U6>0,MIN('1b. Corrected Inputs Segment'!$J$26,U6/'2. Eingaben Fahrzeug-Ebene'!AE6/'2d. Annahmen'!$B$57),0)","v":0},{"$f":"IF(AE6>0,MIN(_xlfn._xlws.FILTER(Ladeleistung,(Ladeleistung>=AE6))),0)","v":0},{"$f":"IF(B6,ROUNDUP(U6/'2. Eingaben Fahrzeug-Ebene'!I6,0),0)","v":0},{"$f":"_xlfn.LET(_xlpm.nS,'3a. Detailierte Ergebnisse'!$E$24,_xlpm.nM,'3a. Detailierte Ergebnisse'!$F$24,_xlpm.nL,'3a. Detailierte Ergebnisse'!$G$24,_xlpm.n,_xlpm.nS+_xlpm.nM+_xlpm.nL,IF(AF6<=100,IF(_xlpm.n<=3,1,1.119/(_xlpm.n^0.094)),IF(AF6<=150,IF(_xlpm.n<=3,1,1.226/(_xlpm.n^0.164)),IF(_xlpm.n=1,1,1.111/(_xlpm.n^0.192)))))","v":{"v":1,"d":"1.00"}},{"$f":"IF(B6,MAX(AD6*AE6/'2d. Annahmen'!$B$56,AD6*AF6*AH6/'2d. Annahmen'!$B$56),0)","v":0},{"$f":"IF(SUM('2. Eingaben Fahrzeug-Ebene'!AA6:AC6)>0,U6/SUM('2. Eingaben Fahrzeug-Ebene'!AA6:AC6),0)","v":0},{"$f":"SUM(S6:T6)+MAX(U6-SUM(E6,J6),0)","v":0},{"$f":"IF('2. Eingaben Fahrzeug-Ebene'!E6,MAX(H6-AK6,0),MAX(H6-AK6,0))","v":0},{"$f":"AK6+AL6-H6+'2. Eingaben Fahrzeug-Ebene'!AA6*AJ6","v":0},{"$f":"-MIN(AM6+'2. Eingaben Fahrzeug-Ebene'!AB6*AJ6-'2. Eingaben Fahrzeug-Ebene'!Z6*I6,0)","v":0},{"$f":"AM6+AN6+'2. Eingaben Fahrzeug-Ebene'!AC6*AJ6-'2. Eingaben Fahrzeug-Ebene'!Z6*I6+'2. Eingaben Fahrzeug-Ebene'!AB6*AJ6","v":0},{"$f":"MAX(J6-AO6,0)","v":0},{"$f":"AO6+AP6-J6","v":0},{"$f":"ABS(SUM(AL6+AN6+AP6)-Q6)<0.0001","v":true},{"$f":"ABS(SUM(S6:U6,Q6)-D6)<0.0001","v":true},{"$f":"ABS(AQ6-(AK6-SUM(S6:T6)))<0.0001","v":true},{"$f":"\"\"","v":""}]
["Segment 3",{"$f":"'2. Eingaben Fahrzeug-Ebene'!B7*(SUM('2. Eingaben Fahrzeug-Ebene'!D7:E7)>0)","v":0},{"$f":"'2. Eingaben Fahrzeug-Ebene'!C7","v":0},{"$f":"'2. Eingaben Fahrzeug-Ebene'!V7*'2. Eingaben Fahrzeug-Ebene'!$J7/100","v":0},{"$f":"'2. Eingaben Fahrzeug-Ebene'!T7*'2. Eingaben Fahrzeug-Ebene'!$J7/100","v":0},{"$f":"IF(B7,E7/'2. Eingaben Fahrzeug-Ebene'!Z7,0)","v":0},{"$f":"'2. Eingaben Fahrzeug-Ebene'!U7*'2. Eingaben Fahrzeug-Ebene'!$J7/100/2","v":0},0,0,0,{"$f":"MIN('2. Eingaben Fahrzeug-Ebene'!AG7*'1b. Corrected Inputs Segment'!$J$24*'2. Eingaben Fahrzeug-Ebene'!AF7*'2d. Annahmen'!$B$57,'2. Eingaben Fahrzeug-Ebene'!I7)","v":0},{"$f":"MIN('2. Eingaben Fahrzeug-Ebene'!AH7*'1b. Corrected Inputs Segment'!$J$25*'2. Eingaben Fahrzeug-Ebene'!AF7*'2d. Annahmen'!$B$57,'2. Eingaben Fahrzeug-Ebene'!I7)","v":0},{"$f":"MIN('1b. Corrected Inputs Segment'!$J$26*'2. Eingaben Fahrzeug-Ebene'!AD7*'2d. Annahmen'!$B$57,'2. Eingaben Fahrzeug-Ebene'!I7)","v":0},{"$f":"M7*SUM('2. Eingaben Fahrzeug-Ebene'!AA7:AC7)","v":0},{"$f":"SUM(MAX(H7-'2. Eingaben Fahrzeug-Ebene'!I7,0),MAX(('2. Eingaben Fahrzeug-Ebene'!Z7)*(I7-'2. Eingaben Fahrzeug-Ebene'!I7),0),MAX(J7-'2. Eingaben Fahrzeug-Ebene'!I7,0))","v":0},0,0,0,0,0,0,{"$f":"(S7>0)*1/'1b. Corrected Inputs Segment'!$J$28","v":0},{"$f":"'1b. Corrected Inputs Segment'!$J$29","v":1},0,{"$f":"IF(T7>0,T7/'2. Eingaben Fahrzeug-Ebene'!AF7/'2d. Annahmen'!$B$57,0)","v":0},{"$f":"IF(Y7>0,MIN(MIN(_xlfn._xlws.FILTER(Ladeleistung,(Ladeleistung>=Y7))),'1b. Corrected Inputs Segment'!$J$25),0)","v":0},{"$f":"IFERROR(0.8/(SUM('3a. Detailierte Ergebnisse'!$T$24:$U$24)^0.401),1)","v":{"v":0.8,"d":"0.80"}},{"$f":"MAX(X7*Y7,X7*'1b. Corrected Inputs Segment'!$J$25*AA7)","v":0},{"$f":"'2. Eingaben Fahrzeug-Ebene'!AI7","v":0},0,{"$f":"IF(U7>0,MIN('1b. Corrected Inputs Segment'!$J$26,U7/'2. Eingaben Fahrzeug-Ebene'!AE7/'2d. Annahmen'!$B$57),0)","v":0},{"$f":"IF(AE7>0,MIN(_xlfn._xlws.FILTER(Ladeleistung,(Ladeleistung>=AE7))),0)","v":0},{"$f":"IF(B7,ROUNDUP(U7/'2. Eingaben Fahrzeug-Ebene'!I7,0),0)","v":0},{"$f":"_xlfn.LET(_xlpm.nS,'3a. Detailierte Ergebnisse'!$E$24,_xlpm.nM,'3a. Detailierte Ergebnisse'!$F$24,_xlpm.nL,'3a. Detailierte Ergebnisse'!$G$24,_xlpm.n,_xlpm.nS+_xlpm.nM+_xlpm.nL,IF(AF7<=100,IF(_xlpm.n<=3,1,1.119/(_xlpm.n^0.094)),IF(AF7<=150,IF(_xlpm.n<=3,1,1.226/(_xlpm.n^0.164)),IF(_xlpm.n=1,1,1.111/(_xlpm.n^0.192)))))","v":{"v":1,"d":"1.00"}},{"$f":"IF(B7,MAX(AD7*AE7/'2d. Annahmen'!$B$56,AD7*AF7*AH7/'2d. Annahmen'!$B$56),0)","v":0},{"$f":"IF(SUM('2. Eingaben Fahrzeug-Ebene'!AA7:AC7)>0,U7/SUM('2. Eingaben Fahrzeug-Ebene'!AA7:AC7),0)","v":0},0,{"$f":"IF('2. Eingaben Fahrzeug-Ebene'!E7,MAX(H7-AK7,0),MAX(H7-AK7,0))","v":0},{"$f":"AK7+AL7-H7+'2. Eingaben Fahrzeug-Ebene'!AA7*AJ7","v":0},{"$f":"-MIN(AM7+'2. Eingaben Fahrzeug-Ebene'!AB7*AJ7-'2. Eingaben Fahrzeug-Ebene'!Z7*I7,0)","v":0},{"$f":"AM7+AN7+'2. Eingaben Fahrzeug-Ebene'!AC7*AJ7-'2. Eingaben Fahrzeug-Ebene'!Z7*I7+'2. Eingaben Fahrzeug-Ebene'!AB7*AJ7","v":0},0,0,true,true,true,{"$f":"\"\"","v":""}]
["Segment 4",{"$f":"'2. Eingaben Fahrzeug-Ebene'!B8*(SUM('2. Eingaben Fahrzeug-Ebene'!D8:E8)>0)","v":0},{"$f":"'2. Eingaben Fahrzeug-Ebene'!C8","v":0},{"$f":"'2. Eingaben Fahrzeug-Ebene'!V8*'2. Eingaben Fahrzeug-Ebene'!$J8/100","v":0},{"$f":"'2. Eingaben Fahrzeug-Ebene'!T8*'2. Eingaben Fahrzeug-Ebene'!$J8/100","v":0},{"$f":"IF(B8,E8/'2. Eingaben Fahrzeug-Ebene'!Z8,0)","v":0},{"$f":"'2. Eingaben Fahrzeug-Ebene'!U8*'2. Eingaben Fahrzeug-Ebene'!$J8/100/2","v":0},0,0,0,{"$f":"MIN('2. Eingaben Fahrzeug-Ebene'!AG8*'1b. Corrected Inputs Segment'!$J$24*'2. Eingaben Fahrzeug-Ebene'!AF8*'2d. Annahmen'!$B$57,'2. Eingaben Fahrzeug-Ebene'!I8)","v":0},{"$f":"MIN('2. Eingaben Fahrzeug-Ebene'!AH8*'1b. Corrected Inputs Segment'!$J$25*'2. Eingaben Fahrzeug-Ebene'!AF8*'2d. Annahmen'!$B$57,'2. Eingaben Fahrzeug-Ebene'!I8)","v":0},{"$f":"MIN('1b. Corrected Inputs Segment'!$J$26*'2. Eingaben Fahrzeug-Ebene'!AD8*'2d. Annahmen'!$B$57,'2. Eingaben Fahrzeug-Ebene'!I8)","v":0},{"$f":"M8*SUM('2. Eingaben Fahrzeug-Ebene'!AA8:AC8)","v":0},{"$f":"SUM(MAX(H8-'2. Eingaben Fahrzeug-Ebene'!I8,0),MAX(('2. Eingaben Fahrzeug-Ebene'!Z8)*(I8-'2. Eingaben Fahrzeug-Ebene'!I8),0),MAX(J8-'2. Eingaben Fahrzeug-Ebene'!I8,0))","v":0},0,0,0,0,0,0,{"$f":"(S8>0)*1/'1b. Corrected Inputs Segment'!$J$28","v":0},{"$f":"'1b. Corrected Inputs Segment'!$J$29","v":1},0,{"$f":"IF(T8>0,T8/'2. Eingaben Fahrzeug-Ebene'!AF8/'2d. Annahmen'!$B$57,0)","v":0},{"$f":"IF(Y8>0,MIN(MIN(_xlfn._xlws.FILTER(Ladeleistung,(Ladeleistung>=Y8))),'1b. Corrected Inputs Segment'!$J$25),0)","v":0},{"$f":"IFERROR(0.8/(SUM('3a. Detailierte Ergebnisse'!$T$24:$U$24)^0.401),1)","v":{"v":0.8,"d":"0.80"}},{"$f":"MAX(X8*Y8,X8*'1b. Corrected Inputs Segment'!$J$25*AA8)","v":0},{"$f":"'2. Eingaben Fahrzeug-Ebene'!AI8","v":0},0,{"$f":"IF(U8>0,MIN('1b. Corrected Inputs Segment'!$J$26,U8/'2. Eingaben Fahrzeug-Ebene'!AE8/'2d. Annahmen'!$B$57),0)","v":0},{"$f":"IF(AE8>0,MIN(_xlfn._xlws.FILTER(Ladeleistung,(Ladeleistung>=AE8))),0)","v":0},{"$f":"IF(B8,ROUNDUP(U8/'2. Eingaben Fahrzeug-Ebene'!I8,0),0)","v":0},{"$f":"_xlfn.LET(_xlpm.nS,'3a. Detailierte Ergebnisse'!$E$24,_xlpm.nM,'3a. Detailierte Ergebnisse'!$F$24,_xlpm.nL,'3a. Detailierte Ergebnisse'!$G$24,_xlpm.n,_xlpm.nS+_xlpm.nM+_xlpm.nL,IF(AF8<=100,IF(_xlpm.n<=3,1,1.119/(_xlpm.n^0.094)),IF(AF8<=150,IF(_xlpm.n<=3,1,1.226/(_xlpm.n^0.164)),IF(_xlpm.n=1,1,1.111/(_xlpm.n^0.192)))))","v":{"v":1,"d":"1.00"}},{"$f":"IF(B8,MAX(AD8*AE8/'2d. Annahmen'!$B$56,AD8*AF8*AH8/'2d. Annahmen'!$B$56),0)","v":0},{"$f":"IF(SUM('2. Eingaben Fahrzeug-Ebene'!AA8:AC8)>0,U8/SUM('2. Eingaben Fahrzeug-Ebene'!AA8:AC8),0)","v":0},0,{"$f":"IF('2. Eingaben Fahrzeug-Ebene'!E8,MAX(H8-AK8,0),MAX(H8-AK8,0))","v":0},{"$f":"AK8+AL8-H8+'2. Eingaben Fahrzeug-Ebene'!AA8*AJ8","v":0},{"$f":"-MIN(AM8+'2. Eingaben Fahrzeug-Ebene'!AB8*AJ8-'2. Eingaben Fahrzeug-Ebene'!Z8*I8,0)","v":0},{"$f":"AM8+AN8+'2. Eingaben Fahrzeug-Ebene'!AC8*AJ8-'2. Eingaben Fahrzeug-Ebene'!Z8*I8+'2. Eingaben Fahrzeug-Ebene'!AB8*AJ8","v":0},0,0,true,true,true,{"$f":"\"\"","v":""}]
["Segment 5",{"$f":"'2. Eingaben Fahrzeug-Ebene'!B9*(SUM('2. Eingaben Fahrzeug-Ebene'!D9:E9)>0)","v":0},{"$f":"'2. Eingaben Fahrzeug-Ebene'!C9","v":0},{"$f":"'2. Eingaben Fahrzeug-Ebene'!V9*'2. Eingaben Fahrzeug-Ebene'!$J9/100","v":0},{"$f":"'2. Eingaben Fahrzeug-Ebene'!T9*'2. Eingaben Fahrzeug-Ebene'!$J9/100","v":0},{"$f":"IF(B9,E9/'2. Eingaben Fahrzeug-Ebene'!Z9,0)","v":0},{"$f":"'2. Eingaben Fahrzeug-Ebene'!U9*'2. Eingaben Fahrzeug-Ebene'!$J9/100/2","v":0},0,0,0,{"$f":"MIN('2. Eingaben Fahrzeug-Ebene'!AG9*'1b. Corrected Inputs Segment'!$J$24*'2. Eingaben Fahrzeug-Ebene'!AF9*'2d. Annahmen'!$B$57,'2. Eingaben Fahrzeug-Ebene'!I9)","v":0},{"$f":"MIN('2. Eingaben Fahrzeug-Ebene'!AH9*'1b. Corrected Inputs Segment'!$J$25*'2. Eingaben Fahrzeug-Ebene'!AF9*'2d. Annahmen'!$B$57,'2. Eingaben Fahrzeug-Ebene'!I9)","v":0},{"$f":"MIN('1b. Corrected Inputs Segment'!$J$26*'2. Eingaben Fahrzeug-Ebene'!AD9*'2d. Annahmen'!$B$57,'2. Eingaben Fahrzeug-Ebene'!I9)","v":0},{"$f":"M9*SUM('2. Eingaben Fahrzeug-Ebene'!AA9:AC9)","v":0},{"$f":"SUM(MAX(H9-'2. Eingaben Fahrzeug-Ebene'!I9,0),MAX(('2. Eingaben Fahrzeug-Ebene'!Z9)*(I9-'2. Eingaben Fahrzeug-Ebene'!I9),0),MAX(J9-'2. Eingaben Fahrzeug-Ebene'!I9,0))","v":0},0,0,0,0,0,0,{"$f":"(S9>0)*1/'1b. Corrected Inputs Segment'!$J$28","v":0},{"$f":"'1b. Corrected Inputs Segment'!$J$29","v":1},0,{"$f":"IF(T9>0,T9/'2. Eingaben Fahrzeug-Ebene'!AF9/'2d. Annahmen'!$B$57,0)","v":0},{"$f":"IF(Y9>0,MIN(MIN(_xlfn._xlws.FILTER(Ladeleistung,(Ladeleistung>=Y9))),'1b. Corrected Inputs Segment'!$J$25),0)","v":0},{"$f":"IFERROR(0.8/(SUM('3a. Detailierte Ergebnisse'!$T$24:$U$24)^0.401),1)","v":{"v":0.8,"d":"0.80"}},{"$f":"MAX(X9*Y9,X9*'1b. Corrected Inputs Segment'!$J$25*AA9)","v":0},{"$f":"'2. Eingaben Fahrzeug-Ebene'!AI9","v":0},0,{"$f":"IF(U9>0,MIN('1b. Corrected Inputs Segment'!$J$26,U9/'2. Eingaben Fahrzeug-Ebene'!AE9/'2d. Annahmen'!$B$57),0)","v":0},{"$f":"IF(AE9>0,MIN(_xlfn._xlws.FILTER(Ladeleistung,(Ladeleistung>=AE9))),0)","v":0},{"$f":"IF(B9,ROUNDUP(U9/'2. Eingaben Fahrzeug-Ebene'!I9,0),0)","v":0},{"$f":"_xlfn.LET(_xlpm.nS,'3a. Detailierte Ergebnisse'!$E$24,_xlpm.nM,'3a. Detailierte Ergebnisse'!$F$24,_xlpm.nL,'3a. Detailierte Ergebnisse'!$G$24,_xlpm.n,_xlpm.nS+_xlpm.nM+_xlpm.nL,IF(AF9<=100,IF(_xlpm.n<=3,1,1.119/(_xlpm.n^0.094)),IF(AF9<=150,IF(_xlpm.n<=3,1,1.226/(_xlpm.n^0.164)),IF(_xlpm.n=1,1,1.111/(_xlpm.n^0.192)))))","v":{"v":1,"d":"1.00"}},{"$f":"IF(B9,MAX(AD9*AE9/'2d. Annahmen'!$B$56,AD9*AF9*AH9/'2d. Annahmen'!$B$56),0)","v":0},{"$f":"IF(SUM('2. Eingaben Fahrzeug-Ebene'!AA9:AC9)>0,U9/SUM('2. Eingaben Fahrzeug-Ebene'!AA9:AC9),0)","v":0},0,{"$f":"IF('2. Eingaben Fahrzeug-Ebene'!E9,MAX(H9-AK9,0),MAX(H9-AK9,0))","v":0},{"$f":"AK9+AL9-H9+'2. Eingaben Fahrzeug-Ebene'!AA9*AJ9","v":0},{"$f":"-MIN(AM9+'2. Eingaben Fahrzeug-Ebene'!AB9*AJ9-'2. Eingaben Fahrzeug-Ebene'!Z9*I9,0)","v":0},{"$f":"AM9+AN9+'2. Eingaben Fahrzeug-Ebene'!AC9*AJ9-'2. Eingaben Fahrzeug-Ebene'!Z9*I9+'2. Eingaben Fahrzeug-Ebene'!AB9*AJ9","v":0},0,0,true,true,true,{"$f":"\"\"","v":""}]
["Segment 6",{"$f":"'2. Eingaben Fahrzeug-Ebene'!B10*(SUM('2. Eingaben Fahrzeug-Ebene'!D10:E10)>0)","v":0},{"$f":"'2. Eingaben Fahrzeug-Ebene'!C10","v":0},{"$f":"'2. Eingaben Fahrzeug-Ebene'!V10*'2. Eingaben Fahrzeug-Ebene'!$J10/100","v":0},{"$f":"'2. Eingaben Fahrzeug-Ebene'!T10*'2. Eingaben Fahrzeug-Ebene'!$J10/100","v":0},{"$f":"IF(B10,E10/'2. Eingaben Fahrzeug-Ebene'!Z10,0)","v":0},{"$f":"'2. Eingaben Fahrzeug-Ebene'!U10*'2. Eingaben Fahrzeug-Ebene'!$J10/100/2","v":0},0,0,0,{"$f":"MIN('2. Eingaben Fahrzeug-Ebene'!AG10*'1b. Corrected Inputs Segment'!$J$24*'2. Eingaben Fahrzeug-Ebene'!AF10*'2d. Annahmen'!$B$57,'2. Eingaben Fahrzeug-Ebene'!I10)","v":0},{"$f":"MIN('2. Eingaben Fahrzeug-Ebene'!AH10*'1b. Corrected Inputs Segment'!$J$25*'2. Eingaben Fahrzeug-Ebene'!AF10*'2d. Annahmen'!$B$57,'2. Eingaben Fahrzeug-Ebene'!I10)","v":0},{"$f":"MIN('1b. Corrected Inputs Segment'!$J$26*'2. Eingaben Fahrzeug-Ebene'!AD10*'2d. Annahmen'!$B$57,'2. Eingaben Fahrzeug-Ebene'!I10)","v":0},{"$f":"M10*SUM('2. Eingaben Fahrzeug-Ebene'!AA10:AC10)","v":0},{"$f":"SUM(MAX(H10-'2. Eingaben Fahrzeug-Ebene'!I10,0),MAX(('2. Eingaben Fahrzeug-Ebene'!Z10)*(I10-'2. Eingaben Fahrzeug-Ebene'!I10),0),MAX(J10-'2. Eingaben Fahrzeug-Ebene'!I10,0))","v":0},0,0,0,0,0,0,{"$f":"(S10>0)*1/'1b. Corrected Inputs Segment'!$J$28","v":0},{"$f":"'1b. Corrected Inputs Segment'!$J$29","v":1},0,{"$f":"IF(T10>0,T10/'2. Eingaben Fahrzeug-Ebene'!AF10/'2d. Annahmen'!$B$57,0)","v":0},{"$f":"IF(Y10>0,MIN(MIN(_xlfn._xlws.FILTER(Ladeleistung,(Ladeleistung>=Y10))),'1b. Corrected Inputs Segment'!$J$25),0)","v":0},{"$f":"IFERROR(0.8/(SUM('3a. Detailierte Ergebnisse'!$T$24:$U$24)^0.401),1)","v":{"v":0.8,"d":"0.80"}},{"$f":"MAX(X10*Y10,X10*'1b. Corrected Inputs Segment'!$J$25*AA10)","v":0},{"$f":"'2. Eingaben Fahrzeug-Ebene'!AI10","v":0},0,{"$f":"IF(U10>0,MIN('1b. Corrected Inputs Segment'!$J$26,U10/'2. Eingaben Fahrzeug-Ebene'!AE10/'2d. Annahmen'!$B$57),0)","v":0},{"$f":"IF(AE10>0,MIN(_xlfn._xlws.FILTER(Ladeleistung,(Ladeleistung>=AE10))),0)","v":0},{"$f":"IF(B10,ROUNDUP(U10/'2. Eingaben Fahrzeug-Ebene'!I10,0),0)","v":0},{"$f":"_xlfn.LET(_xlpm.nS,'3a. Detailierte Ergebnisse'!$E$24,_xlpm.nM,'3a. Detailierte Ergebnisse'!$F$24,_xlpm.nL,'3a. Detailierte Ergebnisse'!$G$24,_xlpm.n,_xlpm.nS+_xlpm.nM+_xlpm.nL,IF(AF10<=100,IF(_xlpm.n<=3,1,1.119/(_xlpm.n^0.094)),IF(AF10<=150,IF(_xlpm.n<=3,1,1.226/(_xlpm.n^0.164)),IF(_xlpm.n=1,1,1.111/(_xlpm.n^0.192)))))","v":{"v":1,"d":"1.00"}},{"$f":"IF(B10,MAX(AD10*AE10/'2d. Annahmen'!$B$56,AD10*AF10*AH10/'2d. Annahmen'!$B$56),0)","v":0},{"$f":"IF(SUM('2. Eingaben Fahrzeug-Ebene'!AA10:AC10)>0,U10/SUM('2. Eingaben Fahrzeug-Ebene'!AA10:AC10),0)","v":0},0,{"$f":"IF('2. Eingaben Fahrzeug-Ebene'!E10,MAX(H10-AK10,0),MAX(H10-AK10,0))","v":0},{"$f":"AK10+AL10-H10+'2. Eingaben Fahrzeug-Ebene'!AA10*AJ10","v":0},{"$f":"-MIN(AM10+'2. Eingaben Fahrzeug-Ebene'!AB10*AJ10-'2. Eingaben Fahrzeug-Ebene'!Z10*I10,0)","v":0},{"$f":"AM10+AN10+'2. Eingaben Fahrzeug-Ebene'!AC10*AJ10-'2. Eingaben Fahrzeug-Ebene'!Z10*I10+'2. Eingaben Fahrzeug-Ebene'!AB10*AJ10","v":0},0,0,true,true,true,{"$f":"\"\"","v":""}]
["Segment 7",{"$f":"'2. Eingaben Fahrzeug-Ebene'!B11*(SUM('2. Eingaben Fahrzeug-Ebene'!D11:E11)>0)","v":0},{"$f":"'2. Eingaben Fahrzeug-Ebene'!C11","v":0},{"$f":"'2. Eingaben Fahrzeug-Ebene'!V11*'2. Eingaben Fahrzeug-Ebene'!$J11/100","v":0},{"$f":"'2. Eingaben Fahrzeug-Ebene'!T11*'2. Eingaben Fahrzeug-Ebene'!$J11/100","v":0},{"$f":"IF(B11,E11/'2. Eingaben Fahrzeug-Ebene'!Z11,0)","v":0},{"$f":"'2. Eingaben Fahrzeug-Ebene'!U11*'2. Eingaben Fahrzeug-Ebene'!$J11/100/2","v":0},0,0,0,{"$f":"MIN('2. Eingaben Fahrzeug-Ebene'!AG11*'1b. Corrected Inputs Segment'!$J$24*'2. Eingaben Fahrzeug-Ebene'!AF11*'2d. Annahmen'!$B$57,'2. Eingaben Fahrzeug-Ebene'!I11)","v":0},{"$f":"MIN('2. Eingaben Fahrzeug-Ebene'!AH11*'1b. Corrected Inputs Segment'!$J$25*'2. Eingaben Fahrzeug-Ebene'!AF11*'2d. Annahmen'!$B$57,'2. Eingaben Fahrzeug-Ebene'!I11)","v":0},{"$f":"MIN('1b. Corrected Inputs Segment'!$J$26*'2. Eingaben Fahrzeug-Ebene'!AD11*'2d. Annahmen'!$B$57,'2. Eingaben Fahrzeug-Ebene'!I11)","v":0},{"$f":"M11*SUM('2. Eingaben Fahrzeug-Ebene'!AA11:AC11)","v":0},{"$f":"SUM(MAX(H11-'2. Eingaben Fahrzeug-Ebene'!I11,0),MAX(('2. Eingaben Fahrzeug-Ebene'!Z11)*(I11-'2. Eingaben Fahrzeug-Ebene'!I11),0),MAX(J11-'2. Eingaben Fahrzeug-Ebene'!I11,0))","v":0},0,0,0,0,0,0,{"$f":"(S11>0)*1/'1b. Corrected Inputs Segment'!$J$28","v":0},{"$f":"'1b. Corrected Inputs Segment'!$J$29","v":1},0,{"$f":"IF(T11>0,T11/'2. Eingaben Fahrzeug-Ebene'!AF11/'2d. Annahmen'!$B$57,0)","v":0},{"$f":"IF(Y11>0,MIN(MIN(_xlfn._xlws.FILTER(Ladeleistung,(Ladeleistung>=Y11))),'1b. Corrected Inputs Segment'!$J$25),0)","v":0},{"$f":"IFERROR(0.8/(SUM('3a. Detailierte Ergebnisse'!$T$24:$U$24)^0.401),1)","v":{"v":0.8,"d":"0.80"}},{"$f":"MAX(X11*Y11,X11*'1b. Corrected Inputs Segment'!$J$25*AA11)","v":0},{"$f":"'2. Eingaben Fahrzeug-Ebene'!AI11","v":0},0,{"$f":"IF(U11>0,MIN('1b. Corrected Inputs Segment'!$J$26,U11/'2. Eingaben Fahrzeug-Ebene'!AE11/'2d. Annahmen'!$B$57),0)","v":0},{"$f":"IF(AE11>0,MIN(_xlfn._xlws.FILTER(Ladeleistung,(Ladeleistung>=AE11))),0)","v":0},{"$f":"IF(B11,ROUNDUP(U11/'2. Eingaben Fahrzeug-Ebene'!I11,0),0)","v":0},{"$f":"_xlfn.LET(_xlpm.nS,'3a. Detailierte Ergebnisse'!$E$24,_xlpm.nM,'3a. Detailierte Ergebnisse'!$F$24,_xlpm.nL,'3a. Detailierte Ergebnisse'!$G$24,_xlpm.n,_xlpm.nS+_xlpm.nM+_xlpm.nL,IF(AF11<=100,IF(_xlpm.n<=3,1,1.119/(_xlpm.n^0.094)),IF(AF11<=150,IF(_xlpm.n<=3,1,1.226/(_xlpm.n^0.164)),IF(_xlpm.n=1,1,1.111/(_xlpm.n^0.192)))))","v":{"v":1,"d":"1.00"}},{"$f":"IF(B11,MAX(AD11*AE11/'2d. Annahmen'!$B$56,AD11*AF11*AH11/'2d. Annahmen'!$B$56),0)","v":0},{"$f":"IF(SUM('2. Eingaben Fahrzeug-Ebene'!AA11:AC11)>0,U11/SUM('2. Eingaben Fahrzeug-Ebene'!AA11:AC11),0)","v":0},0,{"$f":"IF('2. Eingaben Fahrzeug-Ebene'!E11,MAX(H11-AK11,0),MAX(H11-AK11,0))","v":0},{"$f":"AK11+AL11-H11+'2. Eingaben Fahrzeug-Ebene'!AA11*AJ11","v":0},{"$f":"-MIN(AM11+'2. Eingaben Fahrzeug-Ebene'!AB11*AJ11-'2. Eingaben Fahrzeug-Ebene'!Z11*I11,0)","v":0},{"$f":"AM11+AN11+'2. Eingaben Fahrzeug-Ebene'!AC11*AJ11-'2. Eingaben Fahrzeug-Ebene'!Z11*I11+'2. Eingaben Fahrzeug-Ebene'!AB11*AJ11","v":0},0,0,true,true,true,{"$f":"\"\"","v":""}]
["Segment 8",{"$f":"'2. Eingaben Fahrzeug-Ebene'!B12*(SUM('2. Eingaben Fahrzeug-Ebene'!D12:E12)>0)","v":0},{"$f":"'2. Eingaben Fahrzeug-Ebene'!C12","v":0},{"$f":"'2. Eingaben Fahrzeug-Ebene'!V12*'2. Eingaben Fahrzeug-Ebene'!$J12/100","v":0},{"$f":"'2. Eingaben Fahrzeug-Ebene'!T12*'2. Eingaben Fahrzeug-Ebene'!$J12/100","v":0},{"$f":"IF(B12,E12/'2. Eingaben Fahrzeug-Ebene'!Z12,0)","v":0},{"$f":"'2. Eingaben Fahrzeug-Ebene'!U12*'2. Eingaben Fahrzeug-Ebene'!$J12/100/2","v":0},0,0,0,{"$f":"MIN('2. Eingaben Fahrzeug-Ebene'!AG12*'1b. Corrected Inputs Segment'!$J$24*'2. Eingaben Fahrzeug-Ebene'!AF12*'2d. Annahmen'!$B$57,'2. Eingaben Fahrzeug-Ebene'!I12)","v":0},{"$f":"MIN('2. Eingaben Fahrzeug-Ebene'!AH12*'1b. Corrected Inputs Segment'!$J$25*'2. Eingaben Fahrzeug-Ebene'!AF12*'2d. Annahmen'!$B$57,'2. Eingaben Fahrzeug-Ebene'!I12)","v":0},{"$f":"MIN('1b. Corrected Inputs Segment'!$J$26*'2. Eingaben Fahrzeug-Ebene'!AD12*'2d. Annahmen'!$B$57,'2. Eingaben Fahrzeug-Ebene'!I12)","v":0},{"$f":"M12*SUM('2. Eingaben Fahrzeug-Ebene'!AA12:AC12)","v":0},{"$f":"SUM(MAX(H12-'2. Eingaben Fahrzeug-Ebene'!I12,0),MAX(('2. Eingaben Fahrzeug-Ebene'!Z12)*(I12-'2. Eingaben Fahrzeug-Ebene'!I12),0),MAX(J12-'2. Eingaben Fahrzeug-Ebene'!I12,0))","v":0},0,0,0,0,0,0,{"$f":"(S12>0)*1/'1b. Corrected Inputs Segment'!$J$28","v":0},{"$f":"'1b. Corrected Inputs Segment'!$J$29","v":1},0,{"$f":"IF(T12>0,T12/'2. Eingaben Fahrzeug-Ebene'!AF12/'2d. Annahmen'!$B$57,0)","v":0},{"$f":"IF(Y12>0,MIN(MIN(_xlfn._xlws.FILTER(Ladeleistung,(Ladeleistung>=Y12))),'1b. Corrected Inputs Segment'!$J$25),0)","v":0},{"$f":"IFERROR(0.8/(SUM('3a. Detailierte Ergebnisse'!$T$24:$U$24)^0.401),1)","v":{"v":0.8,"d":"0.80"}},{"$f":"MAX(X12*Y12,X12*'1b. Corrected Inputs Segment'!$J$25*AA12)","v":0},{"$f":"'2. Eingaben Fahrzeug-Ebene'!AI12","v":0},0,{"$f":"IF(U12>0,MIN('1b. Corrected Inputs Segment'!$J$26,U12/'2. Eingaben Fahrzeug-Ebene'!AE12/'2d. Annahmen'!$B$57),0)","v":0},{"$f":"IF(AE12>0,MIN(_xlfn._xlws.FILTER(Ladeleistung,(Ladeleistung>=AE12))),0)","v":0},{"$f":"IF(B12,ROUNDUP(U12/'2. Eingaben Fahrzeug-Ebene'!I12,0),0)","v":0},{"$f":"_xlfn.LET(_xlpm.nS,'3a. Detailierte Ergebnisse'!$E$24,_xlpm.nM,'3a. Detailierte Ergebnisse'!$F$24,_xlpm.nL,'3a. Detailierte Ergebnisse'!$G$24,_xlpm.n,_xlpm.nS+_xlpm.nM+_xlpm.nL,IF(AF12<=100,IF(_xlpm.n<=3,1,1.119/(_xlpm.n^0.094)),IF(AF12<=150,IF(_xlpm.n<=3,1,1.226/(_xlpm.n^0.164)),IF(_xlpm.n=1,1,1.111/(_xlpm.n^0.192)))))","v":{"v":1,"d":"1.00"}},{"$f":"IF(B12,MAX(AD12*AE12/'2d. Annahmen'!$B$56,AD12*AF12*AH12/'2d. Annahmen'!$B$56),0)","v":0},{"$f":"IF(SUM('2. Eingaben Fahrzeug-Ebene'!AA12:AC12)>0,U12/SUM('2. Eingaben Fahrzeug-Ebene'!AA12:AC12),0)","v":0},0,{"$f":"IF('2. Eingaben Fahrzeug-Ebene'!E12,MAX(H12-AK12,0),MAX(H12-AK12,0))","v":0},{"$f":"AK12+AL12-H12+'2. Eingaben Fahrzeug-Ebene'!AA12*AJ12","v":0},{"$f":"-MIN(AM12+'2. Eingaben Fahrzeug-Ebene'!AB12*AJ12-'2. Eingaben Fahrzeug-Ebene'!Z12*I12,0)","v":0},{"$f":"AM12+AN12+'2. Eingaben Fahrzeug-Ebene'!AC12*AJ12-'2. Eingaben Fahrzeug-Ebene'!Z12*I12+'2. Eingaben Fahrzeug-Ebene'!AB12*AJ12","v":0},0,0,true,true,true,{"$f":"\"\"","v":""}]
["Segment 9",{"$f":"'2. Eingaben Fahrzeug-Ebene'!B13*(SUM('2. Eingaben Fahrzeug-Ebene'!D13:E13)>0)","v":0},{"$f":"'2. Eingaben Fahrzeug-Ebene'!C13","v":0},{"$f":"'2. Eingaben Fahrzeug-Ebene'!V13*'2. Eingaben Fahrzeug-Ebene'!$J13/100","v":0},{"$f":"'2. Eingaben Fahrzeug-Ebene'!T13*'2. Eingaben Fahrzeug-Ebene'!$J13/100","v":0},{"$f":"IF(B13,E13/'2. Eingaben Fahrzeug-Ebene'!Z13,0)","v":0},{"$f":"'2. Eingaben Fahrzeug-Ebene'!U13*'2. Eingaben Fahrzeug-Ebene'!$J13/100/2","v":0},0,0,0,{"$f":"MIN('2. Eingaben Fahrzeug-Ebene'!AG13*'1b. Corrected Inputs Segment'!$J$24*'2. Eingaben Fahrzeug-Ebene'!AF13*'2d. Annahmen'!$B$57,'2. Eingaben Fahrzeug-Ebene'!I13)","v":0},{"$f":"MIN('2. Eingaben Fahrzeug-Ebene'!AH13*'1b. Corrected Inputs Segment'!$J$25*'2. Eingaben Fahrzeug-Ebene'!AF13*'2d. Annahmen'!$B$57,'2. Eingaben Fahrzeug-Ebene'!I13)","v":0},{"$f":"MIN('1b. Corrected Inputs Segment'!$J$26*'2. Eingaben Fahrzeug-Ebene'!AD13*'2d. Annahmen'!$B$57,'2. Eingaben Fahrzeug-Ebene'!I13)","v":0},{"$f":"M13*SUM('2. Eingaben Fahrzeug-Ebene'!AA13:AC13)","v":0},{"$f":"SUM(MAX(H13-'2. Eingaben Fahrzeug-Ebene'!I13,0),MAX(('2. Eingaben Fahrzeug-Ebene'!Z13)*(I13-'2. Eingaben Fahrzeug-Ebene'!I13),0),MAX(J13-'2. Eingaben Fahrzeug-Ebene'!I13,0))","v":0},0,0,0,0,0,0,{"$f":"(S13>0)*1/'1b. Corrected Inputs Segment'!$J$28","v":0},{"$f":"'1b. Corrected Inputs Segment'!$J$29","v":1},0,{"$f":"IF(T13>0,T13/'2. Eingaben Fahrzeug-Ebene'!AF13/'2d. Annahmen'!$B$57,0)","v":0},{"$f":"IF(Y13>0,MIN(MIN(_xlfn._xlws.FILTER(Ladeleistung,(Ladeleistung>=Y13))),'1b. Corrected Inputs Segment'!$J$25),0)","v":0},{"$f":"IFERROR(0.8/(SUM('3a. Detailierte Ergebnisse'!$T$24:$U$24)^0.401),1)","v":{"v":0.8,"d":"0.80"}},{"$f":"MAX(X13*Y13,X13*'1b. Corrected Inputs Segment'!$J$25*AA13)","v":0},{"$f":"'2. Eingaben Fahrzeug-Ebene'!AI13","v":0},0,{"$f":"IF(U13>0,MIN('1b. Corrected Inputs Segment'!$J$26,U13/'2. Eingaben Fahrzeug-Ebene'!AE13/'2d. Annahmen'!$B$57),0)","v":0},{"$f":"IF(AE13>0,MIN(_xlfn._xlws.FILTER(Ladeleistung,(Ladeleistung>=AE13))),0)","v":0},{"$f":"IF(B13,ROUNDUP(U13/'2. Eingaben Fahrzeug-Ebene'!I13,0),0)","v":0},{"$f":"_xlfn.LET(_xlpm.nS,'3a. Detailierte Ergebnisse'!$E$24,_xlpm.nM,'3a. Detailierte Ergebnisse'!$F$24,_xlpm.nL,'3a. Detailierte Ergebnisse'!$G$24,_xlpm.n,_xlpm.nS+_xlpm.nM+_xlpm.nL,IF(AF13<=100,IF(_xlpm.n<=3,1,1.119/(_xlpm.n^0.094)),IF(AF13<=150,IF(_xlpm.n<=3,1,1.226/(_xlpm.n^0.164)),IF(_xlpm.n=1,1,1.111/(_xlpm.n^0.192)))))","v":{"v":1,"d":"1.00"}},{"$f":"IF(B13,MAX(AD13*AE13/'2d. Annahmen'!$B$56,AD13*AF13*AH13/'2d. Annahmen'!$B$56),0)","v":0},{"$f":"IF(SUM('2. Eingaben Fahrzeug-Ebene'!AA13:AC13)>0,U13/SUM('2. Eingaben Fahrzeug-Ebene'!AA13:AC13),0)","v":0},0,{"$f":"IF('2. Eingaben Fahrzeug-Ebene'!E13,MAX(H13-AK13,0),MAX(H13-AK13,0))","v":0},{"$f":"AK13+AL13-H13+'2. Eingaben Fahrzeug-Ebene'!AA13*AJ13","v":0},{"$f":"-MIN(AM13+'2. Eingaben Fahrzeug-Ebene'!AB13*AJ13-'2. Eingaben Fahrzeug-Ebene'!Z13*I13,0)","v":0},{"$f":"AM13+AN13+'2. Eingaben Fahrzeug-Ebene'!AC13*AJ13-'2. Eingaben Fahrzeug-Ebene'!Z13*I13+'2. Eingaben Fahrzeug-Ebene'!AB13*AJ13","v":0},0,0,true,true,true,{"$f":"\"\"","v":""}]
["Segment 10",{"$f":"'2. Eingaben Fahrzeug-Ebene'!B14*(SUM('2. Eingaben Fahrzeug-Ebene'!D14:E14)>0)","v":0},{"$f":"'2. Eingaben Fahrzeug-Ebene'!C14","v":0},{"$f":"'2. Eingaben Fahrzeug-Ebene'!V14*'2. Eingaben Fahrzeug-Ebene'!$J14/100","v":0},{"$f":"'2. Eingaben Fahrzeug-Ebene'!T14*'2. Eingaben Fahrzeug-Ebene'!$J14/100","v":0},{"$f":"IF(B14,E14/'2. Eingaben Fahrzeug-Ebene'!Z14,0)","v":0},{"$f":"'2. Eingaben Fahrzeug-Ebene'!U14*'2. Eingaben Fahrzeug-Ebene'!$J14/100/2","v":0},0,0,0,{"$f":"MIN('2. Eingaben Fahrzeug-Ebene'!AG14*'1b. Corrected Inputs Segment'!$J$24*'2. Eingaben Fahrzeug-Ebene'!AF14*'2d. Annahmen'!$B$57,'2. Eingaben Fahrzeug-Ebene'!I14)","v":0},{"$f":"MIN('2. Eingaben Fahrzeug-Ebene'!AH14*'1b. Corrected Inputs Segment'!$J$25*'2. Eingaben Fahrzeug-Ebene'!AF14*'2d. Annahmen'!$B$57,'2. Eingaben Fahrzeug-Ebene'!I14)","v":0},{"$f":"MIN('1b. Corrected Inputs Segment'!$J$26*'2. Eingaben Fahrzeug-Ebene'!AD14*'2d. Annahmen'!$B$57,'2. Eingaben Fahrzeug-Ebene'!I14)","v":0},{"$f":"M14*SUM('2. Eingaben Fahrzeug-Ebene'!AA14:AC14)","v":0},{"$f":"SUM(MAX(H14-'2. Eingaben Fahrzeug-Ebene'!I14,0),MAX(('2. Eingaben Fahrzeug-Ebene'!Z14)*(I14-'2. Eingaben Fahrzeug-Ebene'!I14),0),MAX(J14-'2. Eingaben Fahrzeug-Ebene'!I14,0))","v":0},0,0,0,0,0,0,{"$f":"(S14>0)*1/'1b. Corrected Inputs Segment'!$J$28","v":0},{"$f":"'1b. Corrected Inputs Segment'!$J$29","v":1},0,{"$f":"IF(T14>0,T14/'2. Eingaben Fahrzeug-Ebene'!AF14/'2d. Annahmen'!$B$57,0)","v":0},{"$f":"IF(Y14>0,MIN(MIN(_xlfn._xlws.FILTER(Ladeleistung,(Ladeleistung>=Y14))),'1b. Corrected Inputs Segment'!$J$25),0)","v":0},{"$f":"IFERROR(0.8/(SUM('3a. Detailierte Ergebnisse'!$T$24:$U$24)^0.401),1)","v":{"v":0.8,"d":"0.80"}},{"$f":"MAX(X14*Y14,X14*'1b. Corrected Inputs Segment'!$J$25*AA14)","v":0},{"$f":"'2. Eingaben Fahrzeug-Ebene'!AI14","v":0},0,{"$f":"IF(U14>0,MIN('1b. Corrected Inputs Segment'!$J$26,U14/'2. Eingaben Fahrzeug-Ebene'!AE14/'2d. Annahmen'!$B$57),0)","v":0},{"$f":"IF(AE14>0,MIN(_xlfn._xlws.FILTER(Ladeleistung,(Ladeleistung>=AE14))),0)","v":0},{"$f":"IF(B14,ROUNDUP(U14/'2. Eingaben Fahrzeug-Ebene'!I14,0),0)","v":0},{"$f":"_xlfn.LET(_xlpm.nS,'3a. Detailierte Ergebnisse'!$E$24,_xlpm.nM,'3a. Detailierte Ergebnisse'!$F$24,_xlpm.nL,'3a. Detailierte Ergebnisse'!$G$24,_xlpm.n,_xlpm.nS+_xlpm.nM+_xlpm.nL,IF(AF14<=100,IF(_xlpm.n<=3,1,1.119/(_xlpm.n^0.094)),IF(AF14<=150,IF(_xlpm.n<=3,1,1.226/(_xlpm.n^0.164)),IF(_xlpm.n=1,1,1.111/(_xlpm.n^0.192)))))","v":{"v":1,"d":"1.00"}},{"$f":"IF(B14,MAX(AD14*AE14/'2d. Annahmen'!$B$56,AD14*AF14*AH14/'2d. Annahmen'!$B$56),0)","v":0},{"$f":"IF(SUM('2. Eingaben Fahrzeug-Ebene'!AA14:AC14)>0,U14/SUM('2. Eingaben Fahrzeug-Ebene'!AA14:AC14),0)","v":0},0,{"$f":"IF('2. Eingaben Fahrzeug-Ebene'!E14,MAX(H14-AK14,0),MAX(H14-AK14,0))","v":0},{"$f":"AK14+AL14-H14+'2. Eingaben Fahrzeug-Ebene'!AA14*AJ14","v":0},{"$f":"-MIN(AM14+'2. Eingaben Fahrzeug-Ebene'!AB14*AJ14-'2. Eingaben Fahrzeug-Ebene'!Z14*I14,0)","v":0},{"$f":"AM14+AN14+'2. Eingaben Fahrzeug-Ebene'!AC14*AJ14-'2. Eingaben Fahrzeug-Ebene'!Z14*I14+'2. Eingaben Fahrzeug-Ebene'!AB14*AJ14","v":0},0,0,true,true,true,{"$f":"\"\"","v":""}]

{"sheet":"2b. Kosten","index":10,"n_rows":14,"n_cols":57,"rows_kept":14,"hidden":true}
["Arbeitsblatt wird ausgeblendet",null,null,"Verbrauch",{"$nulls":5},"Kosten"]
[null,"In Use?","Anzahl Fahrzeug","E-Fzg",{"$nulls":3},"Verbrenner",null,"Leasing",null,"E-Fzg",{"$nulls":13},"Verbrenner",{"$nulls":13},"Ladeinfrastruktur"]
[{"$nulls":3},"Energiebedarf (inkl. Verluste)","Anteil Wohnort","Anteil Firmenstandort","Anteil öffentlich","Verbrauch",null,"Zinssatz","Laufzeit","Unterhaltskosten","Energiekosten","Flottenverwaltungskosten","Versicherung","Reifen","Anschaffung","Restwert","Anschaffung abzgl. Restwert","Unterhalt","Reifen","Energiekosten","Infrastruktur","Versicherung","Flottenverwaltungskosten","Unterhaltskosten","Energiekosten","Flottenverwaltungskosten","Versicherung","Reifen","Anschaffungskosten","Restwert","Anschaffung abzgl. Restwert","Unterhalt","Reifen","Energiekosten","Infrastruktur","Versicherung","Flottenverwaltungskosten","Ladeinfrastruktur (Wohnort)","Ladeinfrastruktur (Firmenstandort)","Installierte Ladeleistung (Wohnort)","Installierte Ladeleistung (Firmenstandort)","Anschlussleistung (Firmenstandort)","Ladeinfrastruktur (Wohnort)","Ladeinfrastruktur (Firmenstandort, Nacht)","Ladeinfrastruktur (Firmenstandort, Tag)","Ladeinfrastruktur Anschaffung","Ladeinfrastruktur Restwert","Ladeinfrastruktur Unterhalt","Ladeanschluss Stromtarif Auswirkung","Ladeanschluss (Wohnort)","Ausbaustufe C1-C2 (Wohnort)","Ladeanschluss (Firmenstandort)","Ausbaustufe C1-C2 (Firmenstandort)","Basisinfrastruktur","Basisinfrastruktur Restwert"]
[{"$nulls":3},"kWh/Jahr",{"$nulls":3},"l/Tag","l/Jahr",null,"Jahren","CHF/Jahr","CHF/Jahr","CHF/Jahr","CHF/Jahr","CHF/Jahr","CHF","CHF","CHF","CHF","CHF","CHF","CHF","CHF","CHF","CHF/Jahr","CHF/Jahr","CHF/Jahr","CHF/Jahr","CHF/Jahr","CHF","CHF","CHF","CHF","CHF","CHF","CHF","CHF","CHF",{"$nulls":5},"CHF","CHF","CHF","CHF","CHF","CHF/Jahr","CHF/Jahr","CHF","CHF","CHF","CHF","CHF","CHF"]
["Segment 1",{"$f":"SUM('2. Eingaben Fahrzeug-Ebene'!$D5:$E5)","v":1},{"$f":"'2. Eingaben Fahrzeug-Ebene'!C5","v":1},{"$f":"'2. Eingaben Fahrzeug-Ebene'!X5*'2. Eingaben Fahrzeug-Ebene'!J5/100/'2d. Annahmen'!$B$56","v":{"v":4362.222222222222,"d":"4,362"}},{"$f":"IF(B5,'2a. Ladekonzept'!S5/'2a. Ladekonzept'!D5,0)","v":{"v":0,"d":"0%"}},{"$f":"IF(B5,SUM('2a. Ladekonzept'!U5,'2a. Ladekonzept'!T5)/'2a. Ladekonzept'!D5,0)","v":{"v":1,"d":"100%"}},{"$f":"IF(B5,'2a. Ladekonzept'!Q5/'2a. Ladekonzept'!D5,0)","v":{"v":0,"d":"0%"}},{"$f":"'2. Eingaben Fahrzeug-Ebene'!V5*'2. Eingaben Fahrzeug-Ebene'!O5/100","v":{"v":5.8,"d":"5.80"}},{"$f":"'2. Eingaben Fahrzeug-Ebene'!X5*'2. Eingaben Fahrzeug-Ebene'!O5/100","v":{"v":1508,"d":"1,508"}},{"$f":"IF(B5,'1c. Inputs Segment Summary'!Z2,0)","v":{"v":0.03,"d":"3.00%"}},{"$f":"IF(B5,'1c. Inputs Segment Summary'!AA2/12,0)","v":4},{"$f":"IF(B5,'2. Eingaben Fahrzeug-Ebene'!N5*'2. Eingaben Fahrzeug-Ebene'!$X5,0)","v":650},{"$f":"IF(B5,D5*(SUMPRODUCT('1b. Corrected Inputs Segment'!$J$19:$J$21,TRANSPOSE('2b. Kosten'!E5:G5)))+AY5,0)","v":{"v":1046.9333333333332,"d":"1,047"}},{"$f":"IF(B5,INDEX('2d. Annahmen'!$D$22:$D$25,'2. Eingaben Fahrzeug-Ebene'!G5),0)","v":400},{"$f":"IF(B5,INDEX('2d. Annahmen'!$C$22:$C$25,'2. Eingaben Fahrzeug-Ebene'!G5),0)","v":{"v":1200,"d":"1,200"}},{"$f":"IF(B5,INDEX('2d. Annahmen'!$L$4:$L$7,'2. Eingaben Fahrzeug-Ebene'!G5),0)","v":470},{"$f":"IF(B5,'2. Eingaben Fahrzeug-Ebene'!K5,0)","v":{"v":28810.890000000003,"d":"28,811"}},{"$f":"IF(B5,NPV(J5, _xlfn.MAKEARRAY(1, K5, _xlfn.LAMBDA(_xlpm.r,_xlpm.c, IF(_xlpm.c = K5, -'2. Eingaben Fahrzeug-Ebene'!M5, 0)))),0)","v":{"v":-7847.916781457712,"d":"-7,848"}},{"$f":"SUM(Q5:R5)","v":{"v":20962.97321854229,"d":"20,963"}},{"$f":"IF(B5,NPV(J5,_xlfn.MAKEARRAY(K5,1,_xlfn.LAMBDA(_xlpm.r,_xlpm.c,L5))),0)","v":{"v":2416.1139618267403,"d":"2,416"}},{"$f":"IF(B5,NPV(J5,_xlfn.MAKEARRAY(K5,1,_xlfn.LAMBDA(_xlpm.r,_xlpm.c,P5))),0)","v":{"v":1747.0362493208738,"d":"1,747"}},{"$f":"IF(B5,NPV(J5,_xlfn.MAKEARRAY(K5,1,_xlfn.LAMBDA(_xlpm.r,_xlpm.c,M5))),0)","v":{"v":3891.554221182269,"d":"3,892"}},{"$f":"IF(B5,AV5+NPV(J5,_xlfn.MAKEARRAY(K5,1,_xlfn.LAMBDA(_xlpm.r,_xlpm.c,AX5)))+NPV(J5, _xlfn.MAKEARRAY(1, K5, _xlfn.LAMBDA(_xlpm.r,_xlpm.c, IF(_xlpm.c = K5, -AW5, 0))))+BD5+NPV(J5, _xlfn.MAKEARRAY(1, K5, _xlfn.LAMBDA(_xlpm.r,_xlpm.c, IF(_xlpm.c = K5, -BE5, 0)))),0)","v":{"v":1720.6191365841023,"d":"1,721"}},{"$f":"IF(B5,NPV(J5,_xlfn.MAKEARRAY(K5,1,_xlfn.LAMBDA(_xlpm.r,_xlpm.c,O5))),0)","v":{"v":4460.5180833724435,"d":"4,461"}},{"$f":"IF(B5,NPV(J5,_xlfn.MAKEARRAY(K5,1,_xlfn.LAMBDA(_xlpm.r,_xlpm.c,N5))),0)","v":{"v":1486.839361124148,"d":"1,487"}},{"$f":"IF(B5,'2. Eingaben Fahrzeug-Ebene'!S5*'2. Eingaben Fahrzeug-Ebene'!$X5,0)","v":{"v":1300,"d":"1,300"}},{"$f":"IF(B5,I5*'1b. Corrected Inputs Segment'!$J$18,0)","v":{"v":2714.4,"d":"2,714"}},{"$f":"IF(B5,INDEX('2d. Annahmen'!$D$22:$D$25,'2. Eingaben Fahrzeug-Ebene'!G5),0)","v":400},{"$f":"IF(B5,INDEX('2d. Annahmen'!$C$22:$C$25,'2. Eingaben Fahrzeug-Ebene'!G5),0)","v":{"v":1200,"d":"1,200"}},{"$f":"IF(B5,INDEX('2d. Annahmen'!I13:I16,'2. Eingaben Fahrzeug-Ebene'!G5),0)","v":400},{"$f":"IF(B5,'2. Eingaben Fahrzeug-Ebene'!P5,0)","v":{"v":27219.464999999997,"d":"27,219"}},{"$f":"IF(B5,NPV(J5, _xlfn.MAKEARRAY(1, K5, _xlfn.LAMBDA(_xlpm.r,_xlpm.c, IF(_xlpm.c = K5, -'2. Eingaben Fahrzeug-Ebene'!R5, 0)))),0)","v":{"v":-7643.734002735171,"d":"-7,644"}},{"$f":"SUM(AE5:AF5)","v":{"v":19575.730997264825,"d":"19,576"}},{"$f":"IF(B5,NPV(J5,_xlfn.MAKEARRAY(K5,1,_xlfn.LAMBDA(_xlpm.r,_xlpm.c,Z5))),0)","v":{"v":4832.2279236534805,"d":"4,832"}},{"$f":"IF(B5,NPV(J5,_xlfn.MAKEARRAY(K5,1,_xlfn.LAMBDA(_xlpm.r,_xlpm.c,AD5))),0)","v":{"v":1486.839361124148,"d":"1,487"}},{"$f":"IF(B5,NPV(J5,_xlfn.MAKEARRAY(K5,1,_xlfn.LAMBDA(_xlpm.r,_xlpm.c,AA5))),0)","v":{"v":10089.691904588468,"d":"10,090"}},{"$f":"0","v":0},{"$f":"IF(B5,NPV(J5,_xlfn.MAKEARRAY(K5,1,_xlfn.LAMBDA(_xlpm.r,_xlpm.c,AC5))),0)","v":{"v":4460.5180833724435,"d":"4,461"}},{"$f":"IF(B5,NPV(J5,_xlfn.MAKEARRAY(K5,1,_xlfn.LAMBDA(_xlpm.r,_xlpm.c,AB5))),0)","v":{"v":1486.839361124148,"d":"1,487"}},{"$f":"IF('2a. Ladekonzept'!V5>0,'2a. Ladekonzept'!V5&\" x \"&_xlfn.TEXTJOIN(\" \",TRUE,'1b. Corrected Inputs Segment'!$J$24:$K$24),\"\")","v":""},{"$f":"_xlfn.TEXTJOIN(\", \",TRUE,IF('2a. Ladekonzept'!X5>0,'2a. Ladekonzept'!X5&\" x \"&_xlfn.TEXTJOIN(\" \",TRUE,'1b. Corrected Inputs Segment'!$J$25:$K$25),\"\"),IF('2a. Ladekonzept'!AD5>0,'2a. Ladekonzept'!AD5&\" x \"&'2a. Ladekonzept'!AF5&\" kW\",\"\"))","v":"1 x 11 kW"},{"$f":"'2a. Ladekonzept'!V5*'1b. Corrected Inputs Segment'!$J$24","v":0},{"$f":"'2a. Ladekonzept'!X5*'1b. Corrected Inputs Segment'!$J$25+'2a. Ladekonzept'!AD5*'2a. Ladekonzept'!AF5","v":11},{"$f":"MAX('2a. Ladekonzept'!AI5,'2a. Ladekonzept'!AB5)","v":{"v":8.8,"d":"9"}},{"$f":"'2a. Ladekonzept'!V5*'3a. Detailierte Ergebnisse'!$B$28","v":0},{"$f":"IF(B5,'2a. Ladekonzept'!X5*IF('2a. Ladekonzept'!Z5>0,INDEX('3a. Detailierte Ergebnisse'!$T$28:$AE$28,MATCH('2a. Ladekonzept'!Z5,Ladeleistung,0)),0),0)","v":{"v":1632,"d":"1,632"}},{"$f":"IF(B5,'2a. Ladekonzept'!AD5*IF('2a. Ladekonzept'!AF5>0,INDEX('3a. Detailierte Ergebnisse'!$T$28:$AE$28,MATCH('2a. Ladekonzept'!AF5,Ladeleistung,0)),0),0)","v":0},{"$f":"SUM(AS5:AU5)","v":{"v":1632,"d":"1,632"}},{"$f":"AV5*('2d. Annahmen'!$B$54-K5)/'2d. Annahmen'!$B$54","v":{"v":979.2,"d":"979"}},{"$f":"'2d. Annahmen'!$B$55*AV5","v":{"v":24.48,"d":"24"}},{"$f":"IF(AQ5>0,'2d. Annahmen'!$B$69*AQ5,0)*12","v":0},{"$f":"IF(AP5>0,'3a. Detailierte Ergebnisse'!$B$41*AP5,0)","v":0},{"$f":"'2a. Ladekonzept'!V5*'3a. Detailierte Ergebnisse'!$F$39","v":0},{"$f":"IF(AR5>0,'3a. Detailierte Ergebnisse'!$C$41*AR5,0)","v":0},{"$f":"SUM('2a. Ladekonzept'!X5,'2a. Ladekonzept'!AD5)*'3a. Detailierte Ergebnisse'!$J$39","v":{"v":3000,"d":"3,000"}},{"$f":"SUM(AZ5:BC5)","v":{"v":3000,"d":"3,000"}},{"$f":"BD5*('2d. Annahmen'!$B$62-K5)/'2d. Annahmen'!$B$62","v":{"v":2400,"d":"2,400"}}]
["Segment 2",{"$f":"SUM('2. Eingaben Fahrzeug-Ebene'!$D6:$E6)","v":0},{"$f":"'2. Eingaben Fahrzeug-Ebene'!C6","v":0},{"$f":"'2. Eingaben Fahrzeug-Ebene'!X6*'2. Eingaben Fahrzeug-Ebene'!J6/100/'2d. Annahmen'!$B$56","v":0},{"$f":"IF(B6,'2a. Ladekonzept'!S6/'2a. Ladekonzept'!D6,0)","v":{"v":0,"d":"0%"}},{"$f":"IF(B6,SUM('2a. Ladekonzept'!U6,'2a. Ladekonzept'!T6)/'2a. Ladekonzept'!D6,0)","v":{"v":0,"d":"0%"}},{"$f":"IF(B6,'2a. Ladekonzept'!Q6/'2a. Ladekonzept'!D6,0)","v":{"v":0,"d":"0%"}},{"$f":"'2. Eingaben Fahrzeug-Ebene'!V6*'2. Eingaben Fahrzeug-Ebene'!O6/100","v":{"v":0,"d":"0.00"}},{"$f":"'2. Eingaben Fahrzeug-Ebene'!X6*'2. Eingaben Fahrzeug-Ebene'!O6/100","v":0},{"$f":"IF(B6,'1c. Inputs Segment Summary'!Z3,0)","v":{"v":0,"d":"0.00%"}},{"$f":"IF(B6,'1c. Inputs Segment Summary'!AA3/12,0)","v":0},{"$f":"IF(B6,'2. Eingaben Fahrzeug-Ebene'!N6*'2. Eingaben Fahrzeug-Ebene'!$X6,0)","v":0},{"$f":"IF(B6,D6*(SUMPRODUCT('1b. Corrected Inputs Segment'!$J$19:$J$21,TRANSPOSE('2b. Kosten'!E6:G6)))+AY6,0)","v":0},{"$f":"IF(B6,INDEX('2d. Annahmen'!$D$22:$D$25,'2. Eingaben Fahrzeug-Ebene'!G6),0)","v":0},{"$f":"IF(B6,INDEX('2d. Annahmen'!$C$22:$C$25,'2. Eingaben Fahrzeug-Ebene'!G6),0)","v":0},{"$f":"IF(B6,INDEX('2d. Annahmen'!$L$4:$L$7,'2. Eingaben Fahrzeug-Ebene'!G6),0)","v":0},{"$f":"IF(B6,'2. Eingaben Fahrzeug-Ebene'!K6,0)","v":0},{"$f":"IF(B6,NPV(J6, _xlfn.MAKEARRAY(1, K6, _xlfn.LAMBDA(_xlpm.r,_xlpm.c, IF(_xlpm.c = K6, -'2. Eingaben Fahrzeug-Ebene'!M6, 0)))),0)","v":0},{"$f":"SUM(Q6:R6)","v":0},{"$f":"IF(B6,NPV(J6,_xlfn.MAKEARRAY(K6,1,_xlfn.LAMBDA(_xlpm.r,_xlpm.c,L6))),0)","v":0},{"$f":"IF(B6,NPV(J6,_xlfn.MAKEARRAY(K6,1,_xlfn.LAMBDA(_xlpm.r,_xlpm.c,P6))),0)","v":0},{"$f":"IF(B6,NPV(J6,_xlfn.MAKEARRAY(K6,1,_xlfn.LAMBDA(_xlpm.r,_xlpm.c,M6))),0)","v":0},{"$f":"IF(B6,AV6+NPV(J6,_xlfn.MAKEARRAY(K6,1,_xlfn.LAMBDA(_xlpm.r,_xlpm.c,AX6)))+NPV(J6, _xlfn.MAKEARRAY(1, K6, _xlfn.LAMBDA(_xlpm.r,_xlpm.c, IF(_xlpm.c = K6, -AW6, 0))))+BD6+NPV(J6, _xlfn.MAKEARRAY(1, K6, _xlfn.LAMBDA(_xlpm.r,_xlpm.c, IF(_xlpm.c = K6, -BE6, 0)))),0)","v":0},{"$f":"IF(B6,NPV(J6,_xlfn.MAKEARRAY(K6,1,_xlfn.LAMBDA(_xlpm.r,_xlpm.c,O6))),0)","v":0},{"$f":"IF(B6,NPV(J6,_xlfn.MAKEARRAY(K6,1,_xlfn.LAMBDA(_xlpm.r,_xlpm.c,N6))),0)","v":0},{"$f":"IF(B6,'2. Eingaben Fahrzeug-Ebene'!S6*'2. Eingaben Fahrzeug-Ebene'!$X6,0)","v":0},{"$f":"IF(B6,I6*'1b. Corrected Inputs Segment'!$J$18,0)","v":0},{"$f":"IF(B6,INDEX('2d. Annahmen'!$D$22:$D$25,'2. Eingaben Fahrzeug-Ebene'!G6),0)","v":0},{"$f":"IF(B6,INDEX('2d. Annahmen'!$C$22:$C$25,'2. Eingaben Fahrzeug-Ebene'!G6),0)","v":0},{"$f":"IF(B6,INDEX('2d. Annahmen'!I14:I17,'2. Eingaben Fahrzeug-Ebene'!G6),0)","v":0},{"$f":"IF(B6,'2. Eingaben Fahrzeug-Ebene'!P6,0)","v":0},{"$f":"IF(B6,NPV(J6, _xlfn.MAKEARRAY(1, K6, _xlfn.LAMBDA(_xlpm.r,_xlpm.c, IF(_xlpm.c = K6, -'2. Eingaben Fahrzeug-Ebene'!R6, 0)))),0)","v":0},{"$f":"SUM(AE6:AF6)","v":0},{"$f":"IF(B6,NPV(J6,_xlfn.MAKEARRAY(K6,1,_xlfn.LAMBDA(_xlpm.r,_xlpm.c,Z6))),0)","v":0},{"$f":"IF(B6,NPV(J6,_xlfn.MAKEARRAY(K6,1,_xlfn.LAMBDA(_xlpm.r,_xlpm.c,AD6))),0)","v":0},{"$f":"IF(B6,NPV(J6,_xlfn.MAKEARRAY(K6,1,_xlfn.LAMBDA(_xlpm.r,_xlpm.c,AA6))),0)","v":0},{"$f":"0","v":0},{"$f":"IF(B6,NPV(J6,_xlfn.MAKEARRAY(K6,1,_xlfn.LAMBDA(_xlpm.r,_xlpm.c,AC6))),0)","v":0},{"$f":"IF(B6,NPV(J6,_xlfn.MAKEARRAY(K6,1,_xlfn.LAMBDA(_xlpm.r,_xlpm.c,AB6))),0)","v":0},{"$f":"IF('2a. Ladekonzept'!V6>0,'2a. Ladekonzept'!V6&\" x \"&_xlfn.TEXTJOIN(\" \",TRUE,'1b. Corrected Inputs Segment'!$J$24:$K$24),\"\")","v":""},{"$f":"_xlfn.TEXTJOIN(\", \",TRUE,IF('2a. Ladekonzept'!X6>0,'2a. Ladekonzept'!X6&\" x \"&_xlfn.TEXTJOIN(\" \",TRUE,'1b. Corrected Inputs Segment'!$J$25:$K$25),\"\"),IF('2a. Ladekonzept'!AD6>0,'2a. Ladekonzept'!AD6&\" x \"&'2a. Ladekonzept'!AF6&\" kW\",\"\"))","v":""},{"$f":"'2a. Ladekonzept'!V6*'1b. Corrected Inputs Segment'!$J$24","v":0},{"$f":"'2a. Ladekonzept'!X6*'1b. Corrected Inputs Segment'!$J$25+'2a. Ladekonzept'!AD6*'2a. Ladekonzept'!AF6","v":0},{"$f":"MAX('2a. Ladekonzept'!AI6,'2a. Ladekonzept'!AB6)","v":0},{"$f":"'2a. Ladekonzept'!V6*'3a. Detailierte Ergebnisse'!$B$28","v":0},{"$f":"IF(B6,'2a. Ladekonzept'!X6*IF('2a. Ladekonzept'!Z6>0,INDEX('3a. Detailierte Ergebnisse'!$T$28:$AE$28,MATCH('2a. Ladekonzept'!Z6,Ladeleistung,0)),0),0)","v":0},{"$f":"IF(B6,'2a. Ladekonzept'!AD6*IF('2a. Ladekonzept'!AF6>0,INDEX('3a. Detailierte Ergebnisse'!$T$28:$AE$28,MATCH('2a. Ladekonzept'!AF6,Ladeleistung,0)),0),0)","v":0},0,{"$f":"AV6*('2d. Annahmen'!$B$54-K6)/'2d. Annahmen'!$B$54","v":0},{"$f":"'2d. Annahmen'!$B$55*AV6","v":0},{"$f":"IF(AQ6>0,'2d. Annahmen'!$B$69*AQ6,0)*12","v":0},{"$f":"IF(AP6>0,'3a. Detailierte Ergebnisse'!$B$41*AP6,0)","v":0},{"$f":"'2a. Ladekonzept'!V6*'3a. Detailierte Ergebnisse'!$F$39","v":0},{"$f":"IF(AR6>0,'3a. Detailierte Ergebnisse'!$C$41*AR6,0)","v":0},{"$f":"SUM('2a. Ladekonzept'!X6,'2a. Ladekonzept'!AD6)*'3a. Detailierte Ergebnisse'!$J$39","v":0},{"$f":"SUM(AZ6:BC6)","v":0},{"$f":"BD6*('2d. Annahmen'!$B$62-K6)/'2d. Annahmen'!$B$62","v":0}]
["Segment 3",{"$f":"SUM('2. Eingaben Fahrzeug-Ebene'!$D7:$E7)","v":0},{"$f":"'2. Eingaben Fahrzeug-Ebene'!C7","v":0},{"$f":"'2. Eingaben Fahrzeug-Ebene'!X7*'2. Eingaben Fahrzeug-Ebene'!J7/100/'2d. Annahmen'!$B$56","v":0},{"$f":"IF(B7,'2a. Ladekonzept'!S7/'2a. Ladekonzept'!D7,0)","v":{"v":0,"d":"0%"}},{"$f":"IF(B7,SUM('2a. Ladekonzept'!U7,'2a. Ladekonzept'!T7)/'2a. Ladekonzept'!D7,0)","v":{"v":0,"d":"0%"}},{"$f":"IF(B7,'2a. Ladekonzept'!Q7/'2a. Ladekonzept'!D7,0)","v":{"v":0,"d":"0%"}},{"$f":"'2. Eingaben Fahrzeug-Ebene'!V7*'2. Eingaben Fahrzeug-Ebene'!O7/100","v":{"v":0,"d":"0.00"}},{"$f":"'2. Eingaben Fahrzeug-Ebene'!X7*'2. Eingaben Fahrzeug-Ebene'!O7/100","v":0},{"$f":"IF(B7,'1c. Inputs Segment Summary'!Z4,0)","v":{"v":0,"d":"0.00%"}},{"$f":"IF(B7,'1c. Inputs Segment Summary'!AA4/12,0)","v":0},{"$f":"IF(B7,'2. Eingaben Fahrzeug-Ebene'!N7*'2. Eingaben Fahrzeug-Ebene'!$X7,0)","v":0},{"$f":"IF(B7,D7*(SUMPRODUCT('1b. Corrected Inputs Segment'!$J$19:$J$21,TRANSPOSE('2b. Kosten'!E7:G7)))+AY7,0)","v":0},{"$f":"IF(B7,INDEX('2d. Annahmen'!$D$22:$D$25,'2. Eingaben Fahrzeug-Ebene'!G7),0)","v":0},{"$f":"IF(B7,INDEX('2d. Annahmen'!$C$22:$C$25,'2. Eingaben Fahrzeug-Ebene'!G7),0)","v":0},{"$f":"IF(B7,INDEX('2d. Annahmen'!$L$4:$L$7,'2. Eingaben Fahrzeug-Ebene'!G7),0)","v":0},{"$f":"IF(B7,'2. Eingaben Fahrzeug-Ebene'!K7,0)","v":0},{"$f":"IF(B7,NPV(J7, _xlfn.MAKEARRAY(1, K7, _xlfn.LAMBDA(_xlpm.r,_xlpm.c, IF(_xlpm.c = K7, -'2. Eingaben Fahrzeug-Ebene'!M7, 0)))),0)","v":0},0,{"$f":"IF(B7,NPV(J7,_xlfn.MAKEARRAY(K7,1,_xlfn.LAMBDA(_xlpm.r,_xlpm.c,L7))),0)","v":0},{"$f":"IF(B7,NPV(J7,_xlfn.MAKEARRAY(K7,1,_xlfn.LAMBDA(_xlpm.r,_xlpm.c,P7))),0)","v":0},{"$f":"IF(B7,NPV(J7,_xlfn.MAKEARRAY(K7,1,_xlfn.LAMBDA(_xlpm.r,_xlpm.c,M7))),0)","v":0},{"$f":"IF(B7,AV7+NPV(J7,_xlfn.MAKEARRAY(K7,1,_xlfn.LAMBDA(_xlpm.r,_xlpm.c,AX7)))+NPV(J7, _xlfn.MAKEARRAY(1, K7, _xlfn.LAMBDA(_xlpm.r,_xlpm.c, IF(_xlpm.c = K7, -AW7, 0))))+BD7+NPV(J7, _xlfn.MAKEARRAY(1, K7, _xlfn.LAMBDA(_xlpm.r,_xlpm.c, IF(_xlpm.c = K7, -BE7, 0)))),0)","v":0},{"$f":"IF(B7,NPV(J7,_xlfn.MAKEARRAY(K7,1,_xlfn.LAMBDA(_xlpm.r,_xlpm.c,O7))),0)","v":0},{"$f":"IF(B7,NPV(J7,_xlfn.MAKEARRAY(K7,1,_xlfn.LAMBDA(_xlpm.r,_xlpm.c,N7))),0)","v":0},{"$f":"IF(B7,'2. Eingaben Fahrzeug-Ebene'!S7*'2. Eingaben Fahrzeug-Ebene'!$X7,0)","v":0},{"$f":"IF(B7,I7*'1b. Corrected Inputs Segment'!$J$18,0)","v":0},{"$f":"IF(B7,INDEX('2d. Annahmen'!$D$22:$D$25,'2. Eingaben Fahrzeug-Ebene'!G7),0)","v":0},{"$f":"IF(B7,INDEX('2d. Annahmen'!$C$22:$C$25,'2. Eingaben Fahrzeug-Ebene'!G7),0)","v":0},{"$f":"IF(B7,INDEX('2d. Annahmen'!I15:I18,'2. Eingaben Fahrzeug-Ebene'!G7),0)","v":0},{"$f":"IF(B7,'2. Eingaben Fahrzeug-Ebene'!P7,0)","v":0},{"$f":"IF(B7,NPV(J7, _xlfn.MAKEARRAY(1, K7, _xlfn.LAMBDA(_xlpm.r,_xlpm.c, IF(_xlpm.c = K7, -'2. Eingaben Fahrzeug-Ebene'!R7, 0)))),0)","v":0},0,{"$f":"IF(B7,NPV(J7,_xlfn.MAKEARRAY(K7,1,_xlfn.LAMBDA(_xlpm.r,_xlpm.c,Z7))),0)","v":0},{"$f":"IF(B7,NPV(J7,_xlfn.MAKEARRAY(K7,1,_xlfn.LAMBDA(_xlpm.r,_xlpm.c,AD7))),0)","v":0},{"$f":"IF(B7,NPV(J7,_xlfn.MAKEARRAY(K7,1,_xlfn.LAMBDA(_xlpm.r,_xlpm.c,AA7))),0)","v":0},{"$f":"0","v":0},{"$f":"IF(B7,NPV(J7,_xlfn.MAKEARRAY(K7,1,_xlfn.LAMBDA(_xlpm.r,_xlpm.c,AC7))),0)","v":0},{"$f":"IF(B7,NPV(J7,_xlfn.MAKEARRAY(K7,1,_xlfn.LAMBDA(_xlpm.r,_xlpm.c,AB7))),0)","v":0},{"$f":"IF('2a. Ladekonzept'!V7>0,'2a. Ladekonzept'!V7&\" x \"&_xlfn.TEXTJOIN(\" \",TRUE,'1b. Corrected Inputs Segment'!$J$24:$K$24),\"\")","v":""},{"$f":"_xlfn.TEXTJOIN(\", \",TRUE,IF('2a. Ladekonzept'!X7>0,'2a. Ladekonzept'!X7&\" x \"&_xlfn.TEXTJOIN(\" \",TRUE,'1b. Corrected Inputs Segment'!$J$25:$K$25),\"\"),IF('2a. Ladekonzept'!AD7>0,'2a. Ladekonzept'!AD7&\" x \"&'2a. Ladekonzept'!AF7&\" kW\",\"\"))","v":""},{"$f":"'2a. Ladekonzept'!V7*'1b. Corrected Inputs Segment'!$J$24","v":0},{"$f":"'2a. Ladekonzept'!X7*'1b. Corrected Inputs Segment'!$J$25+'2a. Ladekonzept'!AD7*'2a. Ladekonzept'!AF7","v":0},{"$f":"MAX('2a. Ladekonzept'!AI7,'2a. Ladekonzept'!AB7)","v":0},{"$f":"'2a. Ladekonzept'!V7*'3a. Detailierte Ergebnisse'!$B$28","v":0},{"$f":"IF(B7,'2a. Ladekonzept'!X7*IF('2a. Ladekonzept'!Z7>0,INDEX('3a. Detailierte Ergebnisse'!$T$28:$AE$28,MATCH('2a. Ladekonzept'!Z7,Ladeleistung,0)),0),0)","v":0},{"$f":"IF(B7,'2a. Ladekonzept'!AD7*IF('2a. Ladekonzept'!AF7>0,INDEX('3a. Detailierte Ergebnisse'!$T$28:$AE$28,MATCH('2a. Ladekonzept'!AF7,Ladeleistung,0)),0),0)","v":0},0,{"$f":"AV7*('2d. Annahmen'!$B$54-K7)/'2d. Annahmen'!$B$54","v":0},{"$f":"'2d. Annahmen'!$B$55*AV7","v":0},{"$f":"IF(AQ7>0,'2d. Annahmen'!$B$69*AQ7,0)*12","v":0},{"$f":"IF(AP7>0,'3a. Detailierte Ergebnisse'!$B$41*AP7,0)","v":0},{"$f":"'2a. Ladekonzept'!V7*'3a. Detailierte Ergebnisse'!$F$39","v":0},{"$f":"IF(AR7>0,'3a. Detailierte Ergebnisse'!$C$41*AR7,0)","v":0},{"$f":"SUM('2a. Ladekonzept'!X7,'2a. Ladekonzept'!AD7)*'3a. Detailierte Ergebnisse'!$J$39","v":0},0,{"$f":"BD7*('2d. Annahmen'!$B$62-K7)/'2d. Annahmen'!$B$62","v":0}]
["Segment 4",{"$f":"SUM('2. Eingaben Fahrzeug-Ebene'!$D8:$E8)","v":0},{"$f":"'2. Eingaben Fahrzeug-Ebene'!C8","v":0},{"$f":"'2. Eingaben Fahrzeug-Ebene'!X8*'2. Eingaben Fahrzeug-Ebene'!J8/100/'2d. Annahmen'!$B$56","v":0},{"$f":"IF(B8,'2a. Ladekonzept'!S8/'2a. Ladekonzept'!D8,0)","v":{"v":0,"d":"0%"}},{"$f":"IF(B8,SUM('2a. Ladekonzept'!U8,'2a. Ladekonzept'!T8)/'2a. Ladekonzept'!D8,0)","v":{"v":0,"d":"0%"}},{"$f":"IF(B8,'2a. Ladekonzept'!Q8/'2a. Ladekonzept'!D8,0)","v":{"v":0,"d":"0%"}},{"$f":"'2. Eingaben Fahrzeug-Ebene'!V8*'2. Eingaben Fahrzeug-Ebene'!O8/100","v":{"v":0,"d":"0.00"}},{"$f":"'2. Eingaben Fahrzeug-Ebene'!X8*'2. Eingaben Fahrzeug-Ebene'!O8/100","v":0},{"$f":"IF(B8,'1c. Inputs Segment Summary'!Z5,0)","v":{"v":0,"d":"0.00%"}},{"$f":"IF(B8,'1c. Inputs Segment Summary'!AA5/12,0)","v":0},{"$f":"IF(B8,'2. Eingaben Fahrzeug-Ebene'!N8*'2. Eingaben Fahrzeug-Ebene'!$X8,0)","v":0},{"$f":"IF(B8,D8*(SUMPRODUCT('1b. Corrected Inputs Segment'!$J$19:$J$21,TRANSPOSE('2b. Kosten'!E8:G8)))+AY8,0)","v":0},{"$f":"IF(B8,INDEX('2d. Annahmen'!$D$22:$D$25,'2. Eingaben Fahrzeug-Ebene'!G8),0)","v":0},{"$f":"IF(B8,INDEX('2d. Annahmen'!$C$22:$C$25,'2. Eingaben Fahrzeug-Ebene'!G8),0)","v":0},{"$f":"IF(B8,INDEX('2d. Annahmen'!$L$4:$L$7,'2. Eingaben Fahrzeug-Ebene'!G8),0)","v":0},{"$f":"IF(B8,'2. Eingaben Fahrzeug-Ebene'!K8,0)","v":0},{"$f":"IF(B8,NPV(J8, _xlfn.MAKEARRAY(1, K8, _xlfn.LAMBDA(_xlpm.r,_xlpm.c, IF(_xlpm.c = K8, -'2. Eingaben Fahrzeug-Ebene'!M8, 0)))),0)","v":0},0,{"$f":"IF(B8,NPV(J8,_xlfn.MAKEARRAY(K8,1,_xlfn.LAMBDA(_xlpm.r,_xlpm.c,L8))),0)","v":0},{"$f":"IF(B8,NPV(J8,_xlfn.MAKEARRAY(K8,1,_xlfn.LAMBDA(_xlpm.r,_xlpm.c,P8))),0)","v":0},{"$f":"IF(B8,NPV(J8,_xlfn.MAKEARRAY(K8,1,_xlfn.LAMBDA(_xlpm.r,_xlpm.c,M8))),0)","v":0},{"$f":"IF(B8,AV8+NPV(J8,_xlfn.MAKEARRAY(K8,1,_xlfn.LAMBDA(_xlpm.r,_xlpm.c,AX8)))+NPV(J8, _xlfn.MAKEARRAY(1, K8, _xlfn.LAMBDA(_xlpm.r,_xlpm.c, IF(_xlpm.c = K8, -AW8, 0))))+BD8+NPV(J8, _xlfn.MAKEARRAY(1, K8, _xlfn.LAMBDA(_xlpm.r,_xlpm.c, IF(_xlpm.c = K8, -BE8, 0)))),0)","v":0},{"$f":"IF(B8,NPV(J8,_xlfn.MAKEARRAY(K8,1,_xlfn.LAMBDA(_xlpm.r,_xlpm.c,O8))),0)","v":0},{"$f":"IF(B8,NPV(J8,_xlfn.MAKEARRAY(K8,1,_xlfn.LAMBDA(_xlpm.r,_xlpm.c,N8))),0)","v":0},{"$f":"IF(B8,'2. Eingaben Fahrzeug-Ebene'!S8*'2. Eingaben Fahrzeug-Ebene'!$X8,0)","v":0},{"$f":"IF(B8,I8*'1b. Corrected Inputs Segment'!$J$18,0)","v":0},{"$f":"IF(B8,INDEX('2d. Annahmen'!$D$22:$D$25,'2. Eingaben Fahrzeug-Ebene'!G8),0)","v":0},{"$f":"IF(B8,INDEX('2d. Annahmen'!$C$22:$C$25,'2. Eingaben Fahrzeug-Ebene'!G8),0)","v":0},{"$f":"IF(B8,INDEX('2d. Annahmen'!I16:I19,'2. Eingaben Fahrzeug-Ebene'!G8),0)","v":0},{"$f":"IF(B8,'2. Eingaben Fahrzeug-Ebene'!P8,0)","v":0},{"$f":"IF(B8,NPV(J8, _xlfn.MAKEARRAY(1, K8, _xlfn.LAMBDA(_xlpm.r,_xlpm.c, IF(_xlpm.c = K8, -'2. Eingaben Fahrzeug-Ebene'!R8, 0)))),0)","v":0},0,{"$f":"IF(B8,NPV(J8,_xlfn.MAKEARRAY(K8,1,_xlfn.LAMBDA(_xlpm.r,_xlpm.c,Z8))),0)","v":0},{"$f":"IF(B8,NPV(J8,_xlfn.MAKEARRAY(K8,1,_xlfn.LAMBDA(_xlpm.r,_xlpm.c,AD8))),0)","v":0},{"$f":"IF(B8,NPV(J8,_xlfn.MAKEARRAY(K8,1,_xlfn.LAMBDA(_xlpm.r,_xlpm.c,AA8))),0)","v":0},{"$f":"0","v":0},{"$f":"IF(B8,NPV(J8,_xlfn.MAKEARRAY(K8,1,_xlfn.LAMBDA(_xlpm.r,_xlpm.c,AC8))),0)","v":0},{"$f":"IF(B8,NPV(J8,_xlfn.MAKEARRAY(K8,1,_xlfn.LAMBDA(_xlpm.r,_xlpm.c,AB8))),0)","v":0},{"$f":"IF('2a. Ladekonzept'!V8>0,'2a. Ladekonzept'!V8&\" x \"&_xlfn.TEXTJOIN(\" \",TRUE,'1b. Corrected Inputs Segment'!$J$24:$K$24),\"\")","v":""},{"$f":"_xlfn.TEXTJOIN(\", \",TRUE,IF('2a. Ladekonzept'!X8>0,'2a. Ladekonzept'!X8&\" x \"&_xlfn.TEXTJOIN(\" \",TRUE,'1b. Corrected Inputs Segment'!$J$25:$K$25),\"\"),IF('2a. Ladekonzept'!AD8>0,'2a. Ladekonzept'!AD8&\" x \"&'2a. Ladekonzept'!AF8&\" kW\",\"\"))","v":""},{"$f":"'2a. Ladekonzept'!V8*'1b. Corrected Inputs Segment'!$J$24","v":0},{"$f":"'2a. Ladekonzept'!X8*'1b. Corrected Inputs Segment'!$J$25+'2a. Ladekonzept'!AD8*'2a. Ladekonzept'!AF8","v":0},{"$f":"MAX('2a. Ladekonzept'!AI8,'2a. Ladekonzept'!AB8)","v":0},{"$f":"'2a. Ladekonzept'!V8*'3a. Detailierte Ergebnisse'!$B$28","v":0},{"$f":"IF(B8,'2a. Ladekonzept'!X8*IF('2a. Ladekonzept'!Z8>0,INDEX('3a. Detailierte Ergebnisse'!$T$28:$AE$28,MATCH('2a. Ladekonzept'!Z8,Ladeleistung,0)),0),0)","v":0},{"$f":"IF(B8,'2a. Ladekonzept'!AD8*IF('2a. Ladekonzept'!AF8>0,INDEX('3a. Detailierte Ergebnisse'!$T$28:$AE$28,MATCH('2a. Ladekonzept'!AF8,Ladeleistung,0)),0),0)","v":0},0,{"$f":"AV8*('2d. Annahmen'!$B$54-K8)/'2d. Annahmen'!$B$54","v":0},{"$f":"'2d. Annahmen'!$B$55*AV8","v":0},{"$f":"IF(AQ8>0,'2d. Annahmen'!$B$69*AQ8,0)*12","v":0},{"$f":"IF(AP8>0,'3a. Detailierte Ergebnisse'!$B$41*AP8,0)","v":0},{"$f":"'2a. Ladekonzept'!V8*'3a. Detailierte Ergebnisse'!$F$39","v":0},{"$f":"IF(AR8>0,'3a. Detailierte Ergebnisse'!$C$41*AR8,0)","v":0},{"$f":"SUM('2a. Ladekonzept'!X8,'2a. Ladekonzept'!AD8)*'3a. Detailierte Ergebnisse'!$J$39","v":0},0,{"$f":"BD8*('2d. Annahmen'!$B$62-K8)/'2d. Annahmen'!$B$62","v":0}]
["Segment 5",{"$f":"SUM('2. Eingaben Fahrzeug-Ebene'!$D9:$E9)","v":0},{"$f":"'2. Eingaben Fahrzeug-Ebene'!C9","v":0},{"$f":"'2. Eingaben Fahrzeug-Ebene'!X9*'2. Eingaben Fahrzeug-Ebene'!J9/100/'2d. Annahmen'!$B$56","v":0},{"$f":"IF(B9,'2a. Ladekonzept'!S9/'2a. Ladekonzept'!D9,0)","v":{"v":0,"d":"0%"}},{"$f":"IF(B9,SUM('2a. Ladekonzept'!U9,'2a. Ladekonzept'!T9)/'2a. Ladekonzept'!D9,0)","v":{"v":0,"d":"0%"}},{"$f":"IF(B9,'2a. Ladekonzept'!Q9/'2a. Ladekonzept'!D9,0)","v":{"v":0,"d":"0%"}},{"$f":"'2. Eingaben Fahrzeug-Ebene'!V9*'2. Eingaben Fahrzeug-Ebene'!O9/100","v":{"v":0,"d":"0.00"}},{"$f":"'2. Eingaben Fahrzeug-Ebene'!X9*'2. Eingaben Fahrzeug-Ebene'!O9/100","v":0},{"$f":"IF(B9,'1c. Inputs Segment Summary'!Z6,0)","v":{"v":0,"d":"0.00%"}},{"$f":"IF(B9,'1c. Inputs Segment Summary'!AA6/12,0)","v":0},{"$f":"IF(B9,'2. Eingaben Fahrzeug-Ebene'!N9*'2. Eingaben Fahrzeug-Ebene'!$X9,0)","v":0},{"$f":"IF(B9,D9*(SUMPRODUCT('1b. Corrected Inputs Segment'!$J$19:$J$21,TRANSPOSE('2b. Kosten'!E9:G9)))+AY9,0)","v":0},{"$f":"IF(B9,INDEX('2d. Annahmen'!$D$22:$D$25,'2. Eingaben Fahrzeug-Ebene'!G9),0)","v":0},{"$f":"IF(B9,INDEX('2d. Annahmen'!$C$22:$C$25,'2. Eingaben Fahrzeug-Ebene'!G9),0)","v":0},{"$f":"IF(B9,INDEX('2d. Annahmen'!$L$4:$L$7,'2. Eingaben Fahrzeug-Ebene'!G9),0)","v":0},{"$f":"IF(B9,'2. Eingaben Fahrzeug-Ebene'!K9,0)","v":0},{"$f":"IF(B9,NPV(J9, _xlfn.MAKEARRAY(1, K9, _xlfn.LAMBDA(_xlpm.r,_xlpm.c, IF(_xlpm.c = K9, -'2. Eingaben Fahrzeug-Ebene'!M9, 0)))),0)","v":0},0,{"$f":"IF(B9,NPV(J9,_xlfn.MAKEARRAY(K9,1,_xlfn.LAMBDA(_xlpm.r,_xlpm.c,L9))),0)","v":0},{"$f":"IF(B9,NPV(J9,_xlfn.MAKEARRAY(K9,1,_xlfn.LAMBDA(_xlpm.r,_xlpm.c,P9))),0)","v":0},{"$f":"IF(B9,NPV(J9,_xlfn.MAKEARRAY(K9,1,_xlfn.LAMBDA(_xlpm.r,_xlpm.c,M9))),0)","v":0},{"$f":"IF(B9,AV9+NPV(J9,_xlfn.MAKEARRAY(K9,1,_xlfn.LAMBDA(_xlpm.r,_xlpm.c,AX9)))+NPV(J9, _xlfn.MAKEARRAY(1, K9, _xlfn.LAMBDA(_xlpm.r,_xlpm.c, IF(_xlpm.c = K9, -AW9, 0))))+BD9+NPV(J9, _xlfn.MAKEARRAY(1, K9, _xlfn.LAMBDA(_xlpm.r,_xlpm.c, IF(_xlpm.c = K9, -BE9, 0)))),0)","v":0},{"$f":"IF(B9,NPV(J9,_xlfn.MAKEARRAY(K9,1,_xlfn.LAMBDA(_xlpm.r,_xlpm.c,O9))),0)","v":0},{"$f":"IF(B9,NPV(J9,_xlfn.MAKEARRAY(K9,1,_xlfn.LAMBDA(_xlpm.r,_xlpm.c,N9))),0)","v":0},{"$f":"IF(B9,'2. Eingaben Fahrzeug-Ebene'!S9*'2. Eingaben Fahrzeug-Ebene'!$X9,0)","v":0},{"$f":"IF(B9,I9*'1b. Corrected Inputs Segment'!$J$18,0)","v":0},{"$f":"IF(B9,INDEX('2d. Annahmen'!$D$22:$D$25,'2. Eingaben Fahrzeug-Ebene'!G9),0)","v":0},{"$f":"IF(B9,INDEX('2d. Annahmen'!$C$22:$C$25,'2. Eingaben Fahrzeug-Ebene'!G9),0)","v":0},{"$f":"IF(B9,INDEX('2d. Annahmen'!I17:I20,'2. Eingaben Fahrzeug-Ebene'!G9),0)","v":0},{"$f":"IF(B9,'2. Eingaben Fahrzeug-Ebene'!P9,0)","v":0},{"$f":"IF(B9,NPV(J9, _xlfn.MAKEARRAY(1, K9, _xlfn.LAMBDA(_xlpm.r,_xlpm.c, IF(_xlpm.c = K9, -'2. Eingaben Fahrzeug-Ebene'!R9, 0)))),0)","v":0},0,{"$f":"IF(B9,NPV(J9,_xlfn.MAKEARRAY(K9,1,_xlfn.LAMBDA(_xlpm.r,_xlpm.c,Z9))),0)","v":0},{"$f":"IF(B9,NPV(J9,_xlfn.MAKEARRAY(K9,1,_xlfn.LAMBDA(_xlpm.r,_xlpm.c,AD9))),0)","v":0},{"$f":"IF(B9,NPV(J9,_xlfn.MAKEARRAY(K9,1,_xlfn.LAMBDA(_xlpm.r,_xlpm.c,AA9))),0)","v":0},{"$f":"0","v":0},{"$f":"IF(B9,NPV(J9,_xlfn.MAKEARRAY(K9,1,_xlfn.LAMBDA(_xlpm.r,_xlpm.c,AC9))),0)","v":0},{"$f":"IF(B9,NPV(J9,_xlfn.MAKEARRAY(K9,1,_xlfn.LAMBDA(_xlpm.r,_xlpm.c,AB9))),0)","v":0},{"$f":"IF('2a. Ladekonzept'!V9>0,'2a. Ladekonzept'!V9&\" x \"&_xlfn.TEXTJOIN(\" \",TRUE,'1b. Corrected Inputs Segment'!$J$24:$K$24),\"\")","v":""},{"$f":"_xlfn.TEXTJOIN(\", \",TRUE,IF('2a. Ladekonzept'!X9>0,'2a. Ladekonzept'!X9&\" x \"&_xlfn.TEXTJOIN(\" \",TRUE,'1b. Corrected Inputs Segment'!$J$25:$K$25),\"\"),IF('2a. Ladekonzept'!AD9>0,'2a. Ladekonzept'!AD9&\" x \"&'2a. Ladekonzept'!AF9&\" kW\",\"\"))","v":""},{"$f":"'2a. Ladekonzept'!V9*'1b. Corrected Inputs Segment'!$J$24","v":0},{"$f":"'2a. Ladekonzept'!X9*'1b. Corrected Inputs Segment'!$J$25+'2a. Ladekonzept'!AD9*'2a. Ladekonzept'!AF9","v":0},{"$f":"MAX('2a. Ladekonzept'!AI9,'2a. Ladekonzept'!AB9)","v":0},{"$f":"'2a. Ladekonzept'!V9*'3a. Detailierte Ergebnisse'!$B$28","v":0},{"$f":"IF(B9,'2a. Ladekonzept'!X9*IF('2a. Ladekonzept'!Z9>0,INDEX('3a. Detailierte Ergebnisse'!$T$28:$AE$28,MATCH('2a. Ladekonzept'!Z9,Ladeleistung,0)),0),0)","v":0},{"$f":"IF(B9,'2a. Ladekonzept'!AD9*IF('2a. Ladekonzept'!AF9>0,INDEX('3a. Detailierte Ergebnisse'!$T$28:$AE$28,MATCH('2a. Ladekonzept'!AF9,Ladeleistung,0)),0),0)","v":0},0,{"$f":"AV9*('2d. Annahmen'!$B$54-K9)/'2d. Annahmen'!$B$54","v":0},{"$f":"'2d. Annahmen'!$B$55*AV9","v":0},{"$f":"IF(AQ9>0,'2d. Annahmen'!$B$69*AQ9,0)*12","v":0},{"$f":"IF(AP9>0,'3a. Detailierte Ergebnisse'!$B$41*AP9,0)","v":0},{"$f":"'2a. Ladekonzept'!V9*'3a. Detailierte Ergebnisse'!$F$39","v":0},{"$f":"IF(AR9>0,'3a. Detailierte Ergebnisse'!$C$41*AR9,0)","v":0},{"$f":"SUM('2a. Ladekonzept'!X9,'2a. Ladekonzept'!AD9)*'3a. Detailierte Ergebnisse'!$J$39","v":0},0,{"$f":"BD9*('2d. Annahmen'!$B$62-K9)/'2d. Annahmen'!$B$62","v":0}]
["Segment 6",{"$f":"SUM('2. Eingaben Fahrzeug-Ebene'!$D10:$E10)","v":0},{"$f":"'2. Eingaben Fahrzeug-Ebene'!C10","v":0},{"$f":"'2. Eingaben Fahrzeug-Ebene'!X10*'2. Eingaben Fahrzeug-Ebene'!J10/100/'2d. Annahmen'!$B$56","v":0},{"$f":"IF(B10,'2a. Ladekonzept'!S10/'2a. Ladekonzept'!D10,0)","v":{"v":0,"d":"0%"}},{"$f":"IF(B10,SUM('2a. Ladekonzept'!U10,'2a. Ladekonzept'!T10)/'2a. Ladekonzept'!D10,0)","v":{"v":0,"d":"0%"}},{"$f":"IF(B10,'2a. Ladekonzept'!Q10/'2a. Ladekonzept'!D10,0)","v":{"v":0,"d":"0%"}},{"$f":"'2. Eingaben Fahrzeug-Ebene'!V10*'2. Eingaben Fahrzeug-Ebene'!O10/100","v":{"v":0,"d":"0.00"}},{"$f":"'2. Eingaben Fahrzeug-Ebene'!X10*'2. Eingaben Fahrzeug-Ebene'!O10/100","v":0},{"$f":"IF(B10,'1c. Inputs Segment Summary'!Z7,0)","v":{"v":0,"d":"0.00%"}},{"$f":"IF(B10,'1c. Inputs Segment Summary'!AA7/12,0)","v":0},{"$f":"IF(B10,'2. Eingaben Fahrzeug-Ebene'!N10*'2. Eingaben Fahrzeug-Ebene'!$X10,0)","v":0},{"$f":"IF(B10,D10*(SUMPRODUCT('1b. Corrected Inputs Segment'!$J$19:$J$21,TRANSPOSE('2b. Kosten'!E10:G10)))+AY10,0)","v":0},{"$f":"IF(B10,INDEX('2d. Annahmen'!$D$22:$D$25,'2. Eingaben Fahrzeug-Ebene'!G10),0)","v":0},{"$f":"IF(B10,INDEX('2d. Annahmen'!$C$22:$C$25,'2. Eingaben Fahrzeug-Ebene'!G10),0)","v":0},{"$f":"IF(B10,INDEX('2d. Annahmen'!$L$4:$L$7,'2. Eingaben Fahrzeug-Ebene'!G10),0)","v":0},{"$f":"IF(B10,'2. Eingaben Fahrzeug-Ebene'!K10,0)","v":0},{"$f":"IF(B10,NPV(J10, _xlfn.MAKEARRAY(1, K10, _xlfn.LAMBDA(_xlpm.r,_xlpm.c, IF(_xlpm.c = K10, -'2. Eingaben Fahrzeug-Ebene'!M10, 0)))),0)","v":0},0,{"$f":"IF(B10,NPV(J10,_xlfn.MAKEARRAY(K10,1,_xlfn.LAMBDA(_xlpm.r,_xlpm.c,L10))),0)","v":0},{"$f":"IF(B10,NPV(J10,_xlfn.MAKEARRAY(K10,1,_xlfn.LAMBDA(_xlpm.r,_xlpm.c,P10))),0)","v":0},{"$f":"IF(B10,NPV(J10,_xlfn.MAKEARRAY(K10,1,_xlfn.LAMBDA(_xlpm.r,_xlpm.c,M10))),0)","v":0},{"$f":"IF(B10,AV10+NPV(J10,_xlfn.MAKEARRAY(K10,1,_xlfn.LAMBDA(_xlpm.r,_xlpm.c,AX10)))+NPV(J10, _xlfn.MAKEARRAY(1, K10, _xlfn.LAMBDA(_xlpm.r,_xlpm.c, IF(_xlpm.c = K10, -AW10, 0))))+BD10+NPV(J10, _xlfn.MAKEARRAY(1, K10, _xlfn.LAMBDA(_xlpm.r,_xlpm.c, IF(_xlpm.c = K10, -BE10, 0)))),0)","v":0},{"$f":"IF(B10,NPV(J10,_xlfn.MAKEARRAY(K10,1,_xlfn.LAMBDA(_xlpm.r,_xlpm.c,O10))),0)","v":0},{"$f":"IF(B10,NPV(J10,_xlfn.MAKEARRAY(K10,1,_xlfn.LAMBDA(_xlpm.r,_xlpm.c,N10))),0)","v":0},{"$f":"IF(B10,'2. Eingaben Fahrzeug-Ebene'!S10*'2. Eingaben Fahrzeug-Ebene'!$X10,0)","v":0},{"$f":"IF(B10,I10*'1b. Corrected Inputs Segment'!$J$18,0)","v":0},{"$f":"IF(B10,INDEX('2d. Annahmen'!$D$22:$D$25,'2. Eingaben Fahrzeug-Ebene'!G10),0)","v":0},{"$f":"IF(B10,INDEX('2d. Annahmen'!$C$22:$C$25,'2. Eingaben Fahrzeug-Ebene'!G10),0)","v":0},{"$f":"IF(B10,INDEX('2d. Annahmen'!I18:I21,'2. Eingaben Fahrzeug-Ebene'!G10),0)","v":0},{"$f":"IF(B10,'2. Eingaben Fahrzeug-Ebene'!P10,0)","v":0},{"$f":"IF(B10,NPV(J10, _xlfn.MAKEARRAY(1, K10, _xlfn.LAMBDA(_xlpm.r,_xlpm.c, IF(_xlpm.c = K10, -'2. Eingaben Fahrzeug-Ebene'!R10, 0)))),0)","v":0},0,{"$f":"IF(B10,NPV(J10,_xlfn.MAKEARRAY(K10,1,_xlfn.LAMBDA(_xlpm.r,_xlpm.c,Z10))),0)","v":0},{"$f":"IF(B10,NPV(J10,_xlfn.MAKEARRAY(K10,1,_xlfn.LAMBDA(_xlpm.r,_xlpm.c,AD10))),0)","v":0},{"$f":"IF(B10,NPV(J10,_xlfn.MAKEARRAY(K10,1,_xlfn.LAMBDA(_xlpm.r,_xlpm.c,AA10))),0)","v":0},{"$f":"0","v":0},{"$f":"IF(B10,NPV(J10,_xlfn.MAKEARRAY(K10,1,_xlfn.LAMBDA(_xlpm.r,_xlpm.c,AC10))),0)","v":0},{"$f":"IF(B10,NPV(J10,_xlfn.MAKEARRAY(K10,1,_xlfn.LAMBDA(_xlpm.r,_xlpm.c,AB10))),0)","v":0},{"$f":"IF('2a. Ladekonzept'!V10>0,'2a. Ladekonzept'!V10&\" x \"&_xlfn.TEXTJOIN(\" \",TRUE,'1b. Corrected Inputs Segment'!$J$24:$K$24),\"\")","v":""},{"$f":"_xlfn.TEXTJOIN(\", \",TRUE,IF('2a. Ladekonzept'!X10>0,'2a. Ladekonzept'!X10&\" x \"&_xlfn.TEXTJOIN(\" \",TRUE,'1b. Corrected Inputs Segment'!$J$25:$K$25),\"\"),IF('2a. Ladekonzept'!AD10>0,'2a. Ladekonzept'!AD10&\" x \"&'2a. Ladekonzept'!AF10&\" kW\",\"\"))","v":""},{"$f":"'2a. Ladekonzept'!V10*'1b. Corrected Inputs Segment'!$J$24","v":0},{"$f":"'2a. Ladekonzept'!X10*'1b. Corrected Inputs Segment'!$J$25+'2a. Ladekonzept'!AD10*'2a. Ladekonzept'!AF10","v":0},{"$f":"MAX('2a. Ladekonzept'!AI10,'2a. Ladekonzept'!AB10)","v":0},{"$f":"'2a. Ladekonzept'!V10*'3a. Detailierte Ergebnisse'!$B$28","v":0},{"$f":"IF(B10,'2a. Ladekonzept'!X10*IF('2a. Ladekonzept'!Z10>0,INDEX('3a. Detailierte Ergebnisse'!$T$28:$AE$28,MATCH('2a. Ladekonzept'!Z10,Ladeleistung,0)),0),0)","v":0},{"$f":"IF(B10,'2a. Ladekonzept'!AD10*IF('2a. Ladekonzept'!AF10>0,INDEX('3a. Detailierte Ergebnisse'!$T$28:$AE$28,MATCH('2a. Ladekonzept'!AF10,Ladeleistung,0)),0),0)","v":0},0,{"$f":"AV10*('2d. Annahmen'!$B$54-K10)/'2d. Annahmen'!$B$54","v":0},{"$f":"'2d. Annahmen'!$B$55*AV10","v":0},{"$f":"IF(AQ10>0,'2d. Annahmen'!$B$69*AQ10,0)*12","v":0},{"$f":"IF(AP10>0,'3a. Detailierte Ergebnisse'!$B$41*AP10,0)","v":0},{"$f":"'2a. Ladekonzept'!V10*'3a. Detailierte Ergebnisse'!$F$39","v":0},{"$f":"IF(AR10>0,'3a. Detailierte Ergebnisse'!$C$41*AR10,0)","v":0},{"$f":"SUM('2a. Ladekonzept'!X10,'2a. Ladekonzept'!AD10)*'3a. Detailierte Ergebnisse'!$J$39","v":0},0,{"$f":"BD10*('2d. Annahmen'!$B$62-K10)/'2d. Annahmen'!$B$62","v":0}]
["Segment 7",{"$f":"SUM('2. Eingaben Fahrzeug-Ebene'!$D11:$E11)","v":0},{"$f":"'2. Eingaben Fahrzeug-Ebene'!C11","v":0},{"$f":"'2. Eingaben Fahrzeug-Ebene'!X11*'2. Eingaben Fahrzeug-Ebene'!J11/100/'2d. Annahmen'!$B$56","v":0},{"$f":"IF(B11,'2a. Ladekonzept'!S11/'2a. Ladekonzept'!D11,0)","v":{"v":0,"d":"0%"}},{"$f":"IF(B11,SUM('2a. Ladekonzept'!U11,'2a. Ladekonzept'!T11)/'2a. Ladekonzept'!D11,0)","v":{"v":0,"d":"0%"}},{"$f":"IF(B11,'2a. Ladekonzept'!Q11/'2a. Ladekonzept'!D11,0)","v":{"v":0,"d":"0%"}},{"$f":"'2. Eingaben Fahrzeug-Ebene'!V11*'2. Eingaben Fahrzeug-Ebene'!O11/100","v":{"v":0,"d":"0.00"}},{"$f":"'2. Eingaben Fahrzeug-Ebene'!X11*'2. Eingaben Fahrzeug-Ebene'!O11/100","v":0},{"$f":"IF(B11,'1c. Inputs Segment Summary'!Z8,0)","v":{"v":0,"d":"0.00%"}},{"$f":"IF(B11,'1c. Inputs Segment Summary'!AA8/12,0)","v":0},{"$f":"IF(B11,'2. Eingaben Fahrzeug-Ebene'!N11*'2. Eingaben Fahrzeug-Ebene'!$X11,0)","v":0},{"$f":"IF(B11,D11*(SUMPRODUCT('1b. Corrected Inputs Segment'!$J$19:$J$21,TRANSPOSE('2b. Kosten'!E11:G11)))+AY11,0)","v":0},{"$f":"IF(B11,INDEX('2d. Annahmen'!$D$22:$D$25,'2. Eingaben Fahrzeug-Ebene'!G11),0)","v":0},{"$f":"IF(B11,INDEX('2d. Annahmen'!$C$22:$C$25,'2. Eingaben Fahrzeug-Ebene'!G11),0)","v":0},{"$f":"IF(B11,INDEX('2d. Annahmen'!$L$4:$L$7,'2. Eingaben Fahrzeug-Ebene'!G11),0)","v":0},{"$f":"IF(B11,'2. Eingaben Fahrzeug-Ebene'!K11,0)","v":0},{"$f":"IF(B11,NPV(J11, _xlfn.MAKEARRAY(1, K11, _xlfn.LAMBDA(_xlpm.r,_xlpm.c, IF(_xlpm.c = K11, -'2. Eingaben Fahrzeug-Ebene'!M11, 0)))),0)","v":0},0,{"$f":"IF(B11,NPV(J11,_xlfn.MAKEARRAY(K11,1,_xlfn.LAMBDA(_xlpm.r,_xlpm.c,L11))),0)","v":0},{"$f":"IF(B11,NPV(J11,_xlfn.MAKEARRAY(K11,1,_xlfn.LAMBDA(_xlpm.r,_xlpm.c,P11))),0)","v":0},{"$f":"IF(B11,NPV(J11,_xlfn.MAKEARRAY(K11,1,_xlfn.LAMBDA(_xlpm.r,_xlpm.c,M11))),0)","v":0},{"$f":"IF(B11,AV11+NPV(J11,_xlfn.MAKEARRAY(K11,1,_xlfn.LAMBDA(_xlpm.r,_xlpm.c,AX11)))+NPV(J11, _xlfn.MAKEARRAY(1, K11, _xlfn.LAMBDA(_xlpm.r,_xlpm.c, IF(_xlpm.c = K11, -AW11, 0))))+BD11+NPV(J11, _xlfn.MAKEARRAY(1, K11, _xlfn.LAMBDA(_xlpm.r,_xlpm.c, IF(_xlpm.c = K11, -BE11, 0)))),0)","v":0},{"$f":"IF(B11,NPV(J11,_xlfn.MAKEARRAY(K11,1,_xlfn.LAMBDA(_xlpm.r,_xlpm.c,O11))),0)","v":0},{"$f":"IF(B11,NPV(J11,_xlfn.MAKEARRAY(K11,1,_xlfn.LAMBDA(_xlpm.r,_xlpm.c,N11))),0)","v":0},{"$f":"IF(B11,'2. Eingaben Fahrzeug-Ebene'!S11*'2. Eingaben Fahrzeug-Ebene'!$X11,0)","v":0},{"$f":"IF(B11,I11*'1b. Corrected Inputs Segment'!$J$18,0)","v":0},{"$f":"IF(B11,INDEX('2d. Annahmen'!$D$22:$D$25,'2. Eingaben Fahrzeug-Ebene'!G11),0)","v":0},{"$f":"IF(B11,INDEX('2d. Annahmen'!$C$22:$C$25,'2. Eingaben Fahrzeug-Ebene'!G11),0)","v":0},{"$f":"IF(B11,INDEX('2d. Annahmen'!I19:I22,'2. Eingaben Fahrzeug-Ebene'!G11),0)","v":0},{"$f":"IF(B11,'2. Eingaben Fahrzeug-Ebene'!P11,0)","v":0},{"$f":"IF(B11,NPV(J11, _xlfn.MAKEARRAY(1, K11, _xlfn.LAMBDA(_xlpm.r,_xlpm.c, IF(_xlpm.c = K11, -'2. Eingaben Fahrzeug-Ebene'!R11, 0)))),0)","v":0},0,{"$f":"IF(B11,NPV(J11,_xlfn.MAKEARRAY(K11,1,_xlfn.LAMBDA(_xlpm.r,_xlpm.c,Z11))),0)","v":0},{"$f":"IF(B11,NPV(J11,_xlfn.MAKEARRAY(K11,1,_xlfn.LAMBDA(_xlpm.r,_xlpm.c,AD11))),0)","v":0},{"$f":"IF(B11,NPV(J11,_xlfn.MAKEARRAY(K11,1,_xlfn.LAMBDA(_xlpm.r,_xlpm.c,AA11))),0)","v":0},{"$f":"0","v":0},{"$f":"IF(B11,NPV(J11,_xlfn.MAKEARRAY(K11,1,_xlfn.LAMBDA(_xlpm.r,_xlpm.c,AC11))),0)","v":0},{"$f":"IF(B11,NPV(J11,_xlfn.MAKEARRAY(K11,1,_xlfn.LAMBDA(_xlpm.r,_xlpm.c,AB11))),0)","v":0},{"$f":"IF('2a. Ladekonzept'!V11>0,'2a. Ladekonzept'!V11&\" x \"&_xlfn.TEXTJOIN(\" \",TRUE,'1b. Corrected Inputs Segment'!$J$24:$K$24),\"\")","v":""},{"$f":"_xlfn.TEXTJOIN(\", \",TRUE,IF('2a. Ladekonzept'!X11>0,'2a. Ladekonzept'!X11&\" x \"&_xlfn.TEXTJOIN(\" \",TRUE,'1b. Corrected Inputs Segment'!$J$25:$K$25),\"\"),IF('2a. Ladekonzept'!AD11>0,'2a. Ladekonzept'!AD11&\" x \"&'2a. Ladekonzept'!AF11&\" kW\",\"\"))","v":""},{"$f":"'2a. Ladekonzept'!V11*'1b. Corrected Inputs Segment'!$J$24","v":0},{"$f":"'2a. Ladekonzept'!X11*'1b. Corrected Inputs Segment'!$J$25+'2a. Ladekonzept'!AD11*'2a. Ladekonzept'!AF11","v":0},{"$f":"MAX('2a. Ladekonzept'!AI11,'2a. Ladekonzept'!AB11)","v":0},{"$f":"'2a. Ladekonzept'!V11*'3a. Detailierte Ergebnisse'!$B$28","v":0},{"$f":"IF(B11,'2a. Ladekonzept'!X11*IF('2a. Ladekonzept'!Z11>0,INDEX('3a. Detailierte Ergebnisse'!$T$28:$AE$28,MATCH('2a. Ladekonzept'!Z11,Ladeleistung,0)),0),0)","v":0},{"$f":"IF(B11,'2a. Ladekonzept'!AD11*IF('2a. Ladekonzept'!AF11>0,INDEX('3a. Detailierte Ergebnisse'!$T$28:$AE$28,MATCH('2a. Ladekonzept'!AF11,Ladeleistung,0)),0),0)","v":0},0,{"$f":"AV11*('2d. Annahmen'!$B$54-K11)/'2d. Annahmen'!$B$54","v":0},{"$f":"'2d. Annahmen'!$B$55*AV11","v":0},{"$f":"IF(AQ11>0,'2d. Annahmen'!$B$69*AQ11,0)*12","v":0},{"$f":"IF(AP11>0,'3a. Detailierte Ergebnisse'!$B$41*AP11,0)","v":0},{"$f":"'2a. Ladekonzept'!V11*'3a. Detailierte Ergebnisse'!$F$39","v":0},{"$f":"IF(AR11>0,'3a. Detailierte Ergebnisse'!$C$41*AR11,0)","v":0},{"$f":"SUM('2a. Ladekonzept'!X11,'2a. Ladekonzept'!AD11)*'3a. Detailierte Ergebnisse'!$J$39","v":0},0,{"$f":"BD11*('2d. Annahmen'!$B$62-K11)/'2d. Annahmen'!$B$62","v":0}]
["Segment 8",{"$f":"SUM('2. Eingaben Fahrzeug-Ebene'!$D12:$E12)","v":0},{"$f":"'2. Eingaben Fahrzeug-Ebene'!C12","v":0},{"$f":"'2. Eingaben Fahrzeug-Ebene'!X12*'2. Eingaben Fahrzeug-Ebene'!J12/100/'2d. Annahmen'!$B$56","v":0},{"$f":"IF(B12,'2a. Ladekonzept'!S12/'2a. Ladekonzept'!D12,0)","v":{"v":0,"d":"0%"}},{"$f":"IF(B12,SUM('2a. Ladekonzept'!U12,'2a. Ladekonzept'!T12)/'2a. Ladekonzept'!D12,0)","v":{"v":0,"d":"0%"}},{"$f":"IF(B12,'2a. Ladekonzept'!Q12/'2a. Ladekonzept'!D12,0)","v":{"v":0,"d":"0%"}},{"$f":"'2. Eingaben Fahrzeug-Ebene'!V12*'2. Eingaben Fahrzeug-Ebene'!O12/100","v":{"v":0,"d":"0.00"}},{"$f":"'2. Eingaben Fahrzeug-Ebene'!X12*'2. Eingaben Fahrzeug-Ebene'!O12/100","v":0},{"$f":"IF(B12,'1c. Inputs Segment Summary'!Z9,0)","v":{"v":0,"d":"0.00%"}},{"$f":"IF(B12,'1c. Inputs Segment Summary'!AA9/12,0)","v":0},{"$f":"IF(B12,'2. Eingaben Fahrzeug-Ebene'!N12*'2. Eingaben Fahrzeug-Ebene'!$X12,0)","v":0},{"$f":"IF(B12,D12*(SUMPRODUCT('1b. Corrected Inputs Segment'!$J$19:$J$21,TRANSPOSE('2b. Kosten'!E12:G12)))+AY12,0)","v":0},{"$f":"IF(B12,INDEX('2d. Annahmen'!$D$22:$D$25,'2. Eingaben Fahrzeug-Ebene'!G12),0)","v":0},{"$f":"IF(B12,INDEX('2d. Annahmen'!$C$22:$C$25,'2. Eingaben Fahrzeug-Ebene'!G12),0)","v":0},{"$f":"IF(B12,INDEX('2d. Annahmen'!$L$4:$L$7,'2. Eingaben Fahrzeug-Ebene'!G12),0)","v":0},{"$f":"IF(B12,'2. Eingaben Fahrzeug-Ebene'!K12,0)","v":0},{"$f":"IF(B12,NPV(J12, _xlfn.MAKEARRAY(1, K12, _xlfn.LAMBDA(_xlpm.r,_xlpm.c, IF(_xlpm.c = K12, -'2. Eingaben Fahrzeug-Ebene'!M12, 0)))),0)","v":0},0,{"$f":"IF(B12,NPV(J12,_xlfn.MAKEARRAY(K12,1,_xlfn.LAMBDA(_xlpm.r,_xlpm.c,L12))),0)","v":0},{"$f":"IF(B12,NPV(J12,_xlfn.MAKEARRAY(K12,1,_xlfn.LAMBDA(_xlpm.r,_xlpm.c,P12))),0)","v":0},{"$f":"IF(B12,NPV(J12,_xlfn.MAKEARRAY(K12,1,_xlfn.LAMBDA(_xlpm.r,_xlpm.c,M12))),0)","v":0},{"$f":"IF(B12,AV12+NPV(J12,_xlfn.MAKEARRAY(K12,1,_xlfn.LAMBDA(_xlpm.r,_xlpm.c,AX12)))+NPV(J12, _xlfn.MAKEARRAY(1, K12, _xlfn.LAMBDA(_xlpm.r,_xlpm.c, IF(_xlpm.c = K12, -AW12, 0))))+BD12+NPV(J12, _xlfn.MAKEARRAY(1, K12, _xlfn.LAMBDA(_xlpm.r,_xlpm.c, IF(_xlpm.c = K12, -BE12, 0)))),0)","v":0},{"$f":"IF(B12,NPV(J12,_xlfn.MAKEARRAY(K12,1,_xlfn.LAMBDA(_xlpm.r,_xlpm.c,O12))),0)","v":0},{"$f":"IF(B12,NPV(J12,_xlfn.MAKEARRAY(K12,1,_xlfn.LAMBDA(_xlpm.r,_xlpm.c,N12))),0)","v":0},{"$f":"IF(B12,'2. Eingaben Fahrzeug-Ebene'!S12*'2. Eingaben Fahrzeug-Ebene'!$X12,0)","v":0},{"$f":"IF(B12,I12*'1b. Corrected Inputs Segment'!$J$18,0)","v":0},{"$f":"IF(B12,INDEX('2d. Annahmen'!$D$22:$D$25,'2. Eingaben Fahrzeug-Ebene'!G12),0)","v":0},{"$f":"IF(B12,INDEX('2d. Annahmen'!$C$22:$C$25,'2. Eingaben Fahrzeug-Ebene'!G12),0)","v":0},{"$f":"IF(B12,INDEX('2d. Annahmen'!I20:I23,'2. Eingaben Fahrzeug-Ebene'!G12),0)","v":0},{"$f":"IF(B12,'2. Eingaben Fahrzeug-Ebene'!P12,0)","v":0},{"$f":"IF(B12,NPV(J12, _xlfn.MAKEARRAY(1, K12, _xlfn.LAMBDA(_xlpm.r,_xlpm.c, IF(_xlpm.c = K12, -'2. Eingaben Fahrzeug-Ebene'!R12, 0)))),0)","v":0},0,{"$f":"IF(B12,NPV(J12,_xlfn.MAKEARRAY(K12,1,_xlfn.LAMBDA(_xlpm.r,_xlpm.c,Z12))),0)","v":0},{"$f":"IF(B12,NPV(J12,_xlfn.MAKEARRAY(K12,1,_xlfn.LAMBDA(_xlpm.r,_xlpm.c,AD12))),0)","v":0},{"$f":"IF(B12,NPV(J12,_xlfn.MAKEARRAY(K12,1,_xlfn.LAMBDA(_xlpm.r,_xlpm.c,AA12))),0)","v":0},{"$f":"0","v":0},{"$f":"IF(B12,NPV(J12,_xlfn.MAKEARRAY(K12,1,_xlfn.LAMBDA(_xlpm.r,_xlpm.c,AC12))),0)","v":0},{"$f":"IF(B12,NPV(J12,_xlfn.MAKEARRAY(K12,1,_xlfn.LAMBDA(_xlpm.r,_xlpm.c,AB12))),0)","v":0},{"$f":"IF('2a. Ladekonzept'!V12>0,'2a. Ladekonzept'!V12&\" x \"&_xlfn.TEXTJOIN(\" \",TRUE,'1b. Corrected Inputs Segment'!$J$24:$K$24),\"\")","v":""},{"$f":"_xlfn.TEXTJOIN(\", \",TRUE,IF('2a. Ladekonzept'!X12>0,'2a. Ladekonzept'!X12&\" x \"&_xlfn.TEXTJOIN(\" \",TRUE,'1b. Corrected Inputs Segment'!$J$25:$K$25),\"\"),IF('2a. Ladekonzept'!AD12>0,'2a. Ladekonzept'!AD12&\" x \"&'2a. Ladekonzept'!AF12&\" kW\",\"\"))","v":""},{"$f":"'2a. Ladekonzept'!V12*'1b. Corrected Inputs Segment'!$J$24","v":0},{"$f":"'2a. Ladekonzept'!X12*'1b. Corrected Inputs Segment'!$J$25+'2a. Ladekonzept'!AD12*'2a. Ladekonzept'!AF12","v":0},{"$f":"MAX('2a. Ladekonzept'!AI12,'2a. Ladekonzept'!AB12)","v":0},{"$f":"'2a. Ladekonzept'!V12*'3a. Detailierte Ergebnisse'!$B$28","v":0},{"$f":"IF(B12,'2a. Ladekonzept'!X12*IF('2a. Ladekonzept'!Z12>0,INDEX('3a. Detailierte Ergebnisse'!$T$28:$AE$28,MATCH('2a. Ladekonzept'!Z12,Ladeleistung,0)),0),0)","v":0},{"$f":"IF(B12,'2a. Ladekonzept'!AD12*IF('2a. Ladekonzept'!AF12>0,INDEX('3a. Detailierte Ergebnisse'!$T$28:$AE$28,MATCH('2a. Ladekonzept'!AF12,Ladeleistung,0)),0),0)","v":0},0,{"$f":"AV12*('2d. Annahmen'!$B$54-K12)/'2d. Annahmen'!$B$54","v":0},{"$f":"'2d. Annahmen'!$B$55*AV12","v":0},{"$f":"IF(AQ12>0,'2d. Annahmen'!$B$69*AQ12,0)*12","v":0},{"$f":"IF(AP12>0,'3a. Detailierte Ergebnisse'!$B$41*AP12,0)","v":0},{"$f":"'2a. Ladekonzept'!V12*'3a. Detailierte Ergebnisse'!$F$39","v":0},{"$f":"IF(AR12>0,'3a. Detailierte Ergebnisse'!$C$41*AR12,0)","v":0},{"$f":"SUM('2a. Ladekonzept'!X12,'2a. Ladekonzept'!AD12)*'3a. Detailierte Ergebnisse'!$J$39","v":0},0,{"$f":"BD12*('2d. Annahmen'!$B$62-K12)/'2d. Annahmen'!$B$62","v":0}]
["Segment 9",{"$f":"SUM('2. Eingaben Fahrzeug-Ebene'!$D13:$E13)","v":0},{"$f":"'2. Eingaben Fahrzeug-Ebene'!C13","v":0},{"$f":"'2. Eingaben Fahrzeug-Ebene'!X13*'2. Eingaben Fahrzeug-Ebene'!J13/100/'2d. Annahmen'!$B$56","v":0},{"$f":"IF(B13,'2a. Ladekonzept'!S13/'2a. Ladekonzept'!D13,0)","v":{"v":0,"d":"0%"}},{"$f":"IF(B13,SUM('2a. Ladekonzept'!U13,'2a. Ladekonzept'!T13)/'2a. Ladekonzept'!D13,0)","v":{"v":0,"d":"0%"}},{"$f":"IF(B13,'2a. Ladekonzept'!Q13/'2a. Ladekonzept'!D13,0)","v":{"v":0,"d":"0%"}},{"$f":"'2. Eingaben Fahrzeug-Ebene'!V13*'2. Eingaben Fahrzeug-Ebene'!O13/100","v":{"v":0,"d":"0.00"}},{"$f":"'2. Eingaben Fahrzeug-Ebene'!X13*'2. Eingaben Fahrzeug-Ebene'!O13/100","v":0},{"$f":"IF(B13,'1c. Inputs Segment Summary'!Z10,0)","v":{"v":0,"d":"0.00%"}},{"$f":"IF(B13,'1c. Inputs Segment Summary'!AA10/12,0)","v":0},{"$f":"IF(B13,'2. Eingaben Fahrzeug-Ebene'!N13*'2. Eingaben Fahrzeug-Ebene'!$X13,0)","v":0},{"$f":"IF(B13,D13*(SUMPRODUCT('1b. Corrected Inputs Segment'!$J$19:$J$21,TRANSPOSE('2b. Kosten'!E13:G13)))+AY13,0)","v":0},{"$f":"IF(B13,INDEX('2d. Annahmen'!$D$22:$D$25,'2. Eingaben Fahrzeug-Ebene'!G13),0)","v":0},{"$f":"IF(B13,INDEX('2d. Annahmen'!$C$22:$C$25,'2. Eingaben Fahrzeug-Ebene'!G13),0)","v":0},{"$f":"IF(B13,INDEX('2d. Annahmen'!$L$4:$L$7,'2. Eingaben Fahrzeug-Ebene'!G13),0)","v":0},{"$f":"IF(B13,'2. Eingaben Fahrzeug-Ebene'!K13,0)","v":0},{"$f":"IF(B13,NPV(J13, _xlfn.MAKEARRAY(1, K13, _xlfn.LAMBDA(_xlpm.r,_xlpm.c, IF(_xlpm.c = K13, -'2. Eingaben Fahrzeug-Ebene'!M13, 0)))),0)","v":0},0,{"$f":"IF(B13,NPV(J13,_xlfn.MAKEARRAY(K13,1,_xlfn.LAMBDA(_xlpm.r,_xlpm.c,L13))),0)","v":0},{"$f":"IF(B13,NPV(J13,_xlfn.MAKEARRAY(K13,1,_xlfn.LAMBDA(_xlpm.r,_xlpm.c,P13))),0)","v":0},{"$f":"IF(B13,NPV(J13,_xlfn.MAKEARRAY(K13,1,_xlfn.LAMBDA(_xlpm.r,_xlpm.c,M13))),0)","v":0},{"$f":"IF(B13,AV13+NPV(J13,_xlfn.MAKEARRAY(K13,1,_xlfn.LAMBDA(_xlpm.r,_xlpm.c,AX13)))+NPV(J13, _xlfn.MAKEARRAY(1, K13, _xlfn.LAMBDA(_xlpm.r,_xlpm.c, IF(_xlpm.c = K13, -AW13, 0))))+BD13+NPV(J13, _xlfn.MAKEARRAY(1, K13, _xlfn.LAMBDA(_xlpm.r,_xlpm.c, IF(_xlpm.c = K13, -BE13, 0)))),0)","v":0},{"$f":"IF(B13,NPV(J13,_xlfn.MAKEARRAY(K13,1,_xlfn.LAMBDA(_xlpm.r,_xlpm.c,O13))),0)","v":0},{"$f":"IF(B13,NPV(J13,_xlfn.MAKEARRAY(K13,1,_xlfn.LAMBDA(_xlpm.r,_xlpm.c,N13))),0)","v":0},{"$f":"IF(B13,'2. Eingaben Fahrzeug-Ebene'!S13*'2. Eingaben Fahrzeug-Ebene'!$X13,0)","v":0},{"$f":"IF(B13,I13*'1b. Corrected Inputs Segment'!$J$18,0)","v":0},{"$f":"IF(B13,INDEX('2d. Annahmen'!$D$22:$D$25,'2. Eingaben Fahrzeug-Ebene'!G13),0)","v":0},{"$f":"IF(B13,INDEX('2d. Annahmen'!$C$22:$C$25,'2. Eingaben Fahrzeug-Ebene'!G13),0)","v":0},{"$f":"IF(B13,INDEX('2d. Annahmen'!I21:I24,'2. Eingaben Fahrzeug-Ebene'!G13),0)","v":0},{"$f":"IF(B13,'2. Eingaben Fahrzeug-Ebene'!P13,0)","v":0},{"$f":"IF(B13,NPV(J13, _xlfn.MAKEARRAY(1, K13, _xlfn.LAMBDA(_xlpm.r,_xlpm.c, IF(_xlpm.c = K13, -'2. Eingaben Fahrzeug-Ebene'!R13, 0)))),0)","v":0},0,{"$f":"IF(B13,NPV(J13,_xlfn.MAKEARRAY(K13,1,_xlfn.LAMBDA(_xlpm.r,_xlpm.c,Z13))),0)","v":0},{"$f":"IF(B13,NPV(J13,_xlfn.MAKEARRAY(K13,1,_xlfn.LAMBDA(_xlpm.r,_xlpm.c,AD13))),0)","v":0},{"$f":"IF(B13,NPV(J13,_xlfn.MAKEARRAY(K13,1,_xlfn.LAMBDA(_xlpm.r,_xlpm.c,AA13))),0)","v":0},{"$f":"0","v":0},{"$f":"IF(B13,NPV(J13,_xlfn.MAKEARRAY(K13,1,_xlfn.LAMBDA(_xlpm.r,_xlpm.c,AC13))),0)","v":0},{"$f":"IF(B13,NPV(J13,_xlfn.MAKEARRAY(K13,1,_xlfn.LAMBDA(_xlpm.r,_xlpm.c,AB13))),0)","v":0},{"$f":"IF('2a. Ladekonzept'!V13>0,'2a. Ladekonzept'!V13&\" x \"&_xlfn.TEXTJOIN(\" \",TRUE,'1b. Corrected Inputs Segment'!$J$24:$K$24),\"\")","v":""},{"$f":"_xlfn.TEXTJOIN(\", \",TRUE,IF('2a. Ladekonzept'!X13>0,'2a. Ladekonzept'!X13&\" x \"&_xlfn.TEXTJOIN(\" \",TRUE,'1b. Corrected Inputs Segment'!$J$25:$K$25),\"\"),IF('2a. Ladekonzept'!AD13>0,'2a. Ladekonzept'!AD13&\" x \"&'2a. Ladekonzept'!AF13&\" kW\",\"\"))","v":""},{"$f":"'2a. Ladekonzept'!V13*'1b. Corrected Inputs Segment'!$J$24","v":0},{"$f":"'2a. Ladekonzept'!X13*'1b. Corrected Inputs Segment'!$J$25+'2a. Ladekonzept'!AD13*'2a. Ladekonzept'!AF13","v":0},{"$f":"MAX('2a. Ladekonzept'!AI13,'2a. Ladekonzept'!AB13)","v":0},{"$f":"'2a. Ladekonzept'!V13*'3a. Detailierte Ergebnisse'!$B$28","v":0},{"$f":"IF(B13,'2a. Ladekonzept'!X13*IF('2a. Ladekonzept'!Z13>0,INDEX('3a. Detailierte Ergebnisse'!$T$28:$AE$28,MATCH('2a. Ladekonzept'!Z13,Ladeleistung,0)),0),0)","v":0},{"$f":"IF(B13,'2a. Ladekonzept'!AD13*IF('2a. Ladekonzept'!AF13>0,INDEX('3a. Detailierte Ergebnisse'!$T$28:$AE$28,MATCH('2a. Ladekonzept'!AF13,Ladeleistung,0)),0),0)","v":0},0,{"$f":"AV13*('2d. Annahmen'!$B$54-K13)/'2d. Annahmen'!$B$54","v":0},{"$f":"'2d. Annahmen'!$B$55*AV13","v":0},{"$f":"IF(AQ13>0,'2d. Annahmen'!$B$69*AQ13,0)*12","v":0},{"$f":"IF(AP13>0,'3a. Detailierte Ergebnisse'!$B$41*AP13,0)","v":0},{"$f":"'2a. Ladekonzept'!V13*'3a. Detailierte Ergebnisse'!$F$39","v":0},{"$f":"IF(AR13>0,'3a. Detailierte Ergebnisse'!$C$41*AR13,0)","v":0},{"$f":"SUM('2a. Ladekonzept'!X13,'2a. Ladekonzept'!AD13)*'3a. Detailierte Ergebnisse'!$J$39","v":0},0,{"$f":"BD13*('2d. Annahmen'!$B$62-K13)/'2d. Annahmen'!$B$62","v":0}]
["Segment 10",{"$f":"SUM('2. Eingaben Fahrzeug-Ebene'!$D14:$E14)","v":0},{"$f":"'2. Eingaben Fahrzeug-Ebene'!C14","v":0},{"$f":"'2. Eingaben Fahrzeug-Ebene'!X14*'2. Eingaben Fahrzeug-Ebene'!J14/100/'2d. Annahmen'!$B$56","v":0},{"$f":"IF(B14,'2a. Ladekonzept'!S14/'2a. Ladekonzept'!D14,0)","v":{"v":0,"d":"0%"}},{"$f":"IF(B14,SUM('2a. Ladekonzept'!U14,'2a. Ladekonzept'!T14)/'2a. Ladekonzept'!D14,0)","v":{"v":0,"d":"0%"}},{"$f":"IF(B14,'2a. Ladekonzept'!Q14/'2a. Ladekonzept'!D14,0)","v":{"v":0,"d":"0%"}},{"$f":"'2. Eingaben Fahrzeug-Ebene'!V14*'2. Eingaben Fahrzeug-Ebene'!O14/100","v":{"v":0,"d":"0.00"}},{"$f":"'2. Eingaben Fahrzeug-Ebene'!X14*'2. Eingaben Fahrzeug-Ebene'!O14/100","v":0},{"$f":"IF(B14,'1c. Inputs Segment Summary'!Z11,0)","v":{"v":0,"d":"0.00%"}},{"$f":"IF(B14,'1c. Inputs Segment Summary'!AA11/12,0)","v":0},{"$f":"IF(B14,'2. Eingaben Fahrzeug-Ebene'!N14*'2. Eingaben Fahrzeug-Ebene'!$X14,0)","v":0},{"$f":"IF(B14,D14*(SUMPRODUCT('1b. Corrected Inputs Segment'!$J$19:$J$21,TRANSPOSE('2b. Kosten'!E14:G14)))+AY14,0)","v":0},{"$f":"IF(B14,INDEX('2d. Annahmen'!$D$22:$D$25,'2. Eingaben Fahrzeug-Ebene'!G14),0)","v":0},{"$f":"IF(B14,INDEX('2d. Annahmen'!$C$22:$C$25,'2. Eingaben Fahrzeug-Ebene'!G14),0)","v":0},{"$f":"IF(B14,INDEX('2d. Annahmen'!$L$4:$L$7,'2. Eingaben Fahrzeug-Ebene'!G14),0)","v":0},{"$f":"IF(B14,'2. Eingaben Fahrzeug-Ebene'!K14,0)","v":0},{"$f":"IF(B14,NPV(J14, _xlfn.MAKEARRAY(1, K14, _xlfn.LAMBDA(_xlpm.r,_xlpm.c, IF(_xlpm.c = K14, -'2. Eingaben Fahrzeug-Ebene'!M14, 0)))),0)","v":0},0,{"$f":"IF(B14,NPV(J14,_xlfn.MAKEARRAY(K14,1,_xlfn.LAMBDA(_xlpm.r,_xlpm.c,L14))),0)","v":0},{"$f":"IF(B14,NPV(J14,_xlfn.MAKEARRAY(K14,1,_xlfn.LAMBDA(_xlpm.r,_xlpm.c,P14))),0)","v":0},{"$f":"IF(B14,NPV(J14,_xlfn.MAKEARRAY(K14,1,_xlfn.LAMBDA(_xlpm.r,_xlpm.c,M14))),0)","v":0},{"$f":"IF(B14,AV14+NPV(J14,_xlfn.MAKEARRAY(K14,1,_xlfn.LAMBDA(_xlpm.r,_xlpm.c,AX14)))+NPV(J14, _xlfn.MAKEARRAY(1, K14, _xlfn.LAMBDA(_xlpm.r,_xlpm.c, IF(_xlpm.c = K14, -AW14, 0))))+BD14+NPV(J14, _xlfn.MAKEARRAY(1, K14, _xlfn.LAMBDA(_xlpm.r,_xlpm.c, IF(_xlpm.c = K14, -BE14, 0)))),0)","v":0},{"$f":"IF(B14,NPV(J14,_xlfn.MAKEARRAY(K14,1,_xlfn.LAMBDA(_xlpm.r,_xlpm.c,O14))),0)","v":0},{"$f":"IF(B14,NPV(J14,_xlfn.MAKEARRAY(K14,1,_xlfn.LAMBDA(_xlpm.r,_xlpm.c,N14))),0)","v":0},{"$f":"IF(B14,'2. Eingaben Fahrzeug-Ebene'!S14*'2. Eingaben Fahrzeug-Ebene'!$X14,0)","v":0},{"$f":"IF(B14,I14*'1b. Corrected Inputs Segment'!$J$18,0)","v":0},{"$f":"IF(B14,INDEX('2d. Annahmen'!$D$22:$D$25,'2. Eingaben Fahrzeug-Ebene'!G14),0)","v":0},{"$f":"IF(B14,INDEX('2d. Annahmen'!$C$22:$C$25,'2. Eingaben Fahrzeug-Ebene'!G14),0)","v":0},{"$f":"IF(B14,INDEX('2d. Annahmen'!I22:I25,'2. Eingaben Fahrzeug-Ebene'!G14),0)","v":0},{"$f":"IF(B14,'2. Eingaben Fahrzeug-Ebene'!P14,0)","v":0},{"$f":"IF(B14,NPV(J14, _xlfn.MAKEARRAY(1, K14, _xlfn.LAMBDA(_xlpm.r,_xlpm.c, IF(_xlpm.c = K14, -'2. Eingaben Fahrzeug-Ebene'!R14, 0)))),0)","v":0},0,{"$f":"IF(B14,NPV(J14,_xlfn.MAKEARRAY(K14,1,_xlfn.LAMBDA(_xlpm.r,_xlpm.c,Z14))),0)","v":0},{"$f":"IF(B14,NPV(J14,_xlfn.MAKEARRAY(K14,1,_xlfn.LAMBDA(_xlpm.r,_xlpm.c,AD14))),0)","v":0},{"$f":"IF(B14,NPV(J14,_xlfn.MAKEARRAY(K14,1,_xlfn.LAMBDA(_xlpm.r,_xlpm.c,AA14))),0)","v":0},{"$f":"0","v":0},{"$f":"IF(B14,NPV(J14,_xlfn.MAKEARRAY(K14,1,_xlfn.LAMBDA(_xlpm.r,_xlpm.c,AC14))),0)","v":0},{"$f":"IF(B14,NPV(J14,_xlfn.MAKEARRAY(K14,1,_xlfn.LAMBDA(_xlpm.r,_xlpm.c,AB14))),0)","v":0},{"$f":"IF('2a. Ladekonzept'!V14>0,'2a. Ladekonzept'!V14&\" x \"&_xlfn.TEXTJOIN(\" \",TRUE,'1b. Corrected Inputs Segment'!$J$24:$K$24),\"\")","v":""},{"$f":"_xlfn.TEXTJOIN(\", \",TRUE,IF('2a. Ladekonzept'!X14>0,'2a. Ladekonzept'!X14&\" x \"&_xlfn.TEXTJOIN(\" \",TRUE,'1b. Corrected Inputs Segment'!$J$25:$K$25),\"\"),IF('2a. Ladekonzept'!AD14>0,'2a. Ladekonzept'!AD14&\" x \"&'2a. Ladekonzept'!AF14&\" kW\",\"\"))","v":""},{"$f":"'2a. Ladekonzept'!V14*'1b. Corrected Inputs Segment'!$J$24","v":0},{"$f":"'2a. Ladekonzept'!X14*'1b. Corrected Inputs Segment'!$J$25+'2a. Ladekonzept'!AD14*'2a. Ladekonzept'!AF14","v":0},{"$f":"MAX('2a. Ladekonzept'!AI14,'2a. Ladekonzept'!AB14)","v":0},{"$f":"'2a. Ladekonzept'!V14*'3a. Detailierte Ergebnisse'!$B$28","v":0},{"$f":"IF(B14,'2a. Ladekonzept'!X14*IF('2a. Ladekonzept'!Z14>0,INDEX('3a. Detailierte Ergebnisse'!$T$28:$AE$28,MATCH('2a. Ladekonzept'!Z14,Ladeleistung,0)),0),0)","v":0},{"$f":"IF(B14,'2a. Ladekonzept'!AD14*IF('2a. Ladekonzept'!AF14>0,INDEX('3a. Detailierte Ergebnisse'!$T$28:$AE$28,MATCH('2a. Ladekonzept'!AF14,Ladeleistung,0)),0),0)","v":0},0,{"$f":"AV14*('2d. Annahmen'!$B$54-K14)/'2d. Annahmen'!$B$54","v":0},{"$f":"'2d. Annahmen'!$B$55*AV14","v":0},{"$f":"IF(AQ14>0,'2d. Annahmen'!$B$69*AQ14,0)*12","v":0},{"$f":"IF(AP14>0,'3a. Detailierte Ergebnisse'!$B$41*AP14,0)","v":0},{"$f":"'2a. Ladekonzept'!V14*'3a. Detailierte Ergebnisse'!$F$39","v":0},{"$f":"IF(AR14>0,'3a. Detailierte Ergebnisse'!$C$41*AR14,0)","v":0},{"$f":"SUM('2a. Ladekonzept'!X14,'2a. Ladekonzept'!AD14)*'3a. Detailierte Ergebnisse'!$J$39","v":0},{"$f":"SUM(AZ14:BC14)","v":0},{"$f":"BD14*('2d. Annahmen'!$B$62-K14)/'2d. Annahmen'!$B$62","v":0}]

{"sheet":"2c. LCA","index":11,"n_rows":14,"n_cols":29,"rows_kept":14,"hidden":true}
["Arbeitsblatt wird ausgeblendet",{"$nulls":4},"Lebensdauer",{"$nulls":7},"Verbrauch"]
[null,"In Use?","Anzahl Fahrzeug",null,null,"E-Fzg",{"$nulls":3},"Verbrenner",{"$nulls":3},"E-Fzg",{"$nulls":7},"Verbrenner"]
[{"$nulls":7},"Lebensfahrleistung","Correction Factor",null,null,"Lebensfahrleistung","Correction Factor","Direct","Direct NonExhaust","Energy Chain","Maintenance","Vehicle","End-Of-Life","Infrastructure","Sum","Direct","Direct NonExhaust","Energy Chain","Maintenance","Vehicle","End-Of-Life","Infrastructure","Sum"]
[{"$nulls":7},"km",{"$nulls":3},"km",null,"g CO2-eq./vkm","g CO2-eq./vkm","g CO2-eq./vkm","g CO2-eq./vkm","g CO2-eq./vkm","g CO2-eq./vkm","g CO2-eq./vkm","g CO2-eq./vkm","g CO2-eq./vkm","g CO2-eq./vkm","g CO2-eq./vkm","g CO2-eq./vkm","g CO2-eq./vkm","g CO2-eq./vkm","g CO2-eq./vkm","g CO2-eq./vkm"]
["Segment 1",{"$f":"SUM('2. Eingaben Fahrzeug-Ebene'!$D5:$E5)","v":1},{"$f":"'2. Eingaben Fahrzeug-Ebene'!C5","v":1},{"$f":"\"Passenger car\"","v":"Passenger car"},{"$f":"IF(B5,INDEX(OFFSET(Grösse,0,1),'2. Eingaben Fahrzeug-Ebene'!G5),\"\")","v":"Medium"},{"$f":"IF(B5,D5&\"BEV\"&E5,\"\")","v":"Passenger carBEVMedium"},{"$f":"IF(B5,MATCH(F5,'2e. Umweltrechner Verkehr'!C:C&'2e. Umweltrechner Verkehr'!D:D&'2e. Umweltrechner Verkehr'!I:I,0),0)","v":3},{"$f":"IF(B5,INDEX('2e. Umweltrechner Verkehr'!Q$1:Q$91,$G5),0)","v":200000},{"$f":"IF(B5,MIN(H5/'2. Eingaben Fahrzeug-Ebene'!Y5,1),0)","v":{"v":1,"d":"1.00"}},{"$f":"IF(B5,D5&\"ICEV-p\"&E5,\"\")","v":"Passenger carICEV-pMedium"},{"$f":"IF(B5,MATCH(J5,'2e. Umweltrechner Verkehr'!C:C&'2e. Umweltrechner Verkehr'!D:D&'2e. Umweltrechner Verkehr'!I:I,0),0)","v":7},{"$f":"IF(B5,INDEX('2e. Umweltrechner Verkehr'!Q$1:Q$91,$K5),0)","v":200000},{"$f":"IF(B5,MIN(L5/'2. Eingaben Fahrzeug-Ebene'!Y5,1),0)","v":{"v":1,"d":"1.00"}},{"$f":"IF(B5,INDEX('2e. Umweltrechner Verkehr'!AC$1:AC$91,$G5)*$B5,0)","v":{"v":0,"d":"0.0"}},{"$f":"IF(B5,INDEX('2e. Umweltrechner Verkehr'!AD$1:AD$91,$G5)*$B5,0)","v":{"v":0,"d":"0.0"}},{"$f":"IF(B5,INDEX('2e. Umweltrechner Verkehr'!AE$1:AE$91,$G5)*$B5,0)","v":{"v":22.2272,"d":"22.2"}},{"$f":"IF(B5,INDEX('2e. Umweltrechner Verkehr'!AF$1:AF$91,$G5)*$B5,0)","v":{"v":6.66355830726537,"d":"6.7"}},{"$f":"IF(B5,INDEX('2e. Umweltrechner Verkehr'!AG$1:AG$91,$G5)*I5*$B5,0)","v":{"v":59.5432333634171,"d":"59.5"}},{"$f":"IF(B5,INDEX('2e. Umweltrechner Verkehr'!AH$1:AH$91,$G5)*I5*$B5,0)","v":{"v":6.8420153383249,"d":"6.8"}},{"$f":"IF(B5,INDEX('2e. Umweltrechner Verkehr'!AI$1:AI$91,$G5)*$B5,0)","v":{"v":19.1709119809397,"d":"19.2"}},{"$f":"SUM(N5:T5)","v":{"v":114.44691898994708,"d":"114.4"}},{"$f":"IF(B5,INDEX('2e. Umweltrechner Verkehr'!AC$1:AC$91,$K5)*$B5,0)","v":{"v":133.151095059442,"d":"133.2"}},{"$f":"IF(B5,INDEX('2e. Umweltrechner Verkehr'!AD$1:AD$91,$K5)*$B5,0)","v":{"v":0,"d":"0.0"}},{"$f":"IF(B5,INDEX('2e. Umweltrechner Verkehr'!AE$1:AE$91,$K5)*$B5,0)","v":{"v":36.24981411,"d":"36.2"}},{"$f":"IF(B5,INDEX('2e. Umweltrechner Verkehr'!AF$1:AF$91,$K5)*$B5,0)","v":{"v":5.43353206321057,"d":"5.4"}},{"$f":"IF(B5,INDEX('2e. Umweltrechner Verkehr'!AG$1:AG$91,$K5)*M5*$B5,0)","v":{"v":33.485891173287,"d":"33.5"}},{"$f":"IF(B5,INDEX('2e. Umweltrechner Verkehr'!AH$1:AH$91,$K5)*M5*$B5,0)","v":{"v":5.51993762075296,"d":"5.5"}},{"$f":"IF(B5,INDEX('2e. Umweltrechner Verkehr'!AI$1:AI$91,$K5)*$B5,0)","v":{"v":16.9790574836848,"d":"17.0"}},{"$f":"SUM(V5:AB5)","v":{"v":230.81932751037735,"d":"230.8"}}]
["Segment 2",{"$f":"SUM('2. Eingaben Fahrzeug-Ebene'!$D6:$E6)","v":0},{"$f":"'2. Eingaben Fahrzeug-Ebene'!C6","v":0},{"$f":"\"Passenger car\"","v":"Passenger car"},{"$f":"IF(B6,INDEX(OFFSET(Grösse,0,1),'2. Eingaben Fahrzeug-Ebene'!G6),\"\")","v":""},{"$f":"IF(B6,D6&\"BEV\"&E6,\"\")","v":""},{"$f":"IF(B6,MATCH(F6,'2e. Umweltrechner Verkehr'!C:C&'2e. Umweltrechner Verkehr'!D:D&'2e. Umweltrechner Verkehr'!I:I,0),0)","v":0},{"$f":"IF(B6,INDEX('2e. Umweltrechner Verkehr'!Q$1:Q$91,$G6),0)","v":0},{"$f":"IF(B6,MIN(H6/'2. Eingaben Fahrzeug-Ebene'!Y6,1),0)","v":{"v":0,"d":"0.00"}},{"$f":"IF(B6,D6&\"ICEV-p\"&E6,\"\")","v":""},{"$f":"IF(B6,MATCH(J6,'2e. Umweltrechner Verkehr'!C:C&'2e. Umweltrechner Verkehr'!D:D&'2e. Umweltrechner Verkehr'!I:I,0),0)","v":0},{"$f":"IF(B6,INDEX('2e. Umweltrechner Verkehr'!Q$1:Q$91,$K6),0)","v":0},{"$f":"IF(B6,MIN(L6/'2. Eingaben Fahrzeug-Ebene'!Y6,1),0)","v":{"v":0,"d":"0.00"}},{"$f":"IF(B6,INDEX('2e. Umweltrechner Verkehr'!AC$1:AC$91,$G6)*$B6,0)","v":{"v":0,"d":"0.0"}},{"$f":"IF(B6,INDEX('2e. Umweltrechner Verkehr'!AD$1:AD$91,$G6)*$B6,0)","v":{"v":0,"d":"0.0"}},{"$f":"IF(B6,INDEX('2e. Umweltrechner Verkehr'!AE$1:AE$91,$G6)*$B6,0)","v":{"v":0,"d":"0.0"}},{"$f":"IF(B6,INDEX('2e. Umweltrechner Verkehr'!AF$1:AF$91,$G6)*$B6,0)","v":{"v":0,"d":"0.0"}},{"$f":"IF(B6,INDEX('2e. Umweltrechner Verkehr'!AG$1:AG$91,$G6)*I6*$B6,0)","v":{"v":0,"d":"0.0"}},{"$f":"IF(B6,INDEX('2e. Umweltrechner Verkehr'!AH$1:AH$91,$G6)*I6*$B6,0)","v":{"v":0,"d":"0.0"}},{"$f":"IF(B6,INDEX('2e. Umweltrechner Verkehr'!AI$1:AI$91,$G6)*$B6,0)","v":{"v":0,"d":"0.0"}},{"$f":"SUM(N6:T6)","v":{"v":0,"d":"0.0"}},{"$f":"IF(B6,INDEX('2e. Umweltrechner Verkehr'!AC$1:AC$91,$K6)*$B6,0)","v":{"v":0,"d":"0.0"}},{"$f":"IF(B6,INDEX('2e. Umweltrechner Verkehr'!AD$1:AD$91,$K6)*$B6,0)","v":{"v":0,"d":"0.0"}},{"$f":"IF(B6,INDEX('2e. Umweltrechner Verkehr'!AE$1:AE$91,$K6)*$B6,0)","v":{"v":0,"d":"0.0"}},{"$f":"IF(B6,INDEX('2e. Umweltrechner Verkehr'!AF$1:AF$91,$K6)*$B6,0)","v":{"v":0,"d":"0.0"}},{"$f":"IF(B6,INDEX('2e. Umweltrechner Verkehr'!AG$1:AG$91,$K6)*M6*$B6,0)","v":{"v":0,"d":"0.0"}},{"$f":"IF(B6,INDEX('2e. Umweltrechner Verkehr'!AH$1:AH$91,$K6)*M6*$B6,0)","v":{"v":0,"d":"0.0"}},{"$f":"IF(B6,INDEX('2e. Umweltrechner Verkehr'!AI$1:AI$91,$K6)*$B6,0)","v":{"v":0,"d":"0.0"}},{"$f":"SUM(V6:AB6)","v":{"v":0,"d":"0.0"}}]
["Segment 3",{"$f":"SUM('2. Eingaben Fahrzeug-Ebene'!$D7:$E7)","v":0},{"$f":"'2. Eingaben Fahrzeug-Ebene'!C7","v":0},"Passenger car",{"$f":"IF(B7,INDEX(OFFSET(Grösse,0,1),'2. Eingaben Fahrzeug-Ebene'!G7),\"\")","v":""},"",{"$f":"IF(B7,MATCH(F7,'2e. Umweltrechner Verkehr'!C:C&'2e. Umweltrechner Verkehr'!D:D&'2e. Umweltrechner Verkehr'!I:I,0),0)","v":0},{"$f":"IF(B7,INDEX('2e. Umweltrechner Verkehr'!Q$1:Q$91,$G7),0)","v":0},{"$f":"IF(B7,MIN(H7/'2. Eingaben Fahrzeug-Ebene'!Y7,1),0)","v":{"v":0,"d":"0.00"}},"",{"$f":"IF(B7,MATCH(J7,'2e. Umweltrechner Verkehr'!C:C&'2e. Umweltrechner Verkehr'!D:D&'2e. Umweltrechner Verkehr'!I:I,0),0)","v":0},{"$f":"IF(B7,INDEX('2e. Umweltrechner Verkehr'!Q$1:Q$91,$K7),0)","v":0},{"$f":"IF(B7,MIN(L7/'2. Eingaben Fahrzeug-Ebene'!Y7,1),0)","v":{"v":0,"d":"0.00"}},{"$f":"IF(B7,INDEX('2e. Umweltrechner Verkehr'!AC$1:AC$91,$G7)*$B7,0)","v":{"v":0,"d":"0.0"}},{"$f":"IF(B7,INDEX('2e. Umweltrechner Verkehr'!AD$1:AD$91,$G7)*$B7,0)","v":{"v":0,"d":"0.0"}},{"$f":"IF(B7,INDEX('2e. Umweltrechner Verkehr'!AE$1:AE$91,$G7)*$B7,0)","v":{"v":0,"d":"0.0"}},{"$f":"IF(B7,INDEX('2e. Umweltrechner Verkehr'!AF$1:AF$91,$G7)*$B7,0)","v":{"v":0,"d":"0.0"}},{"$f":"IF(B7,INDEX('2e. Umweltrechner Verkehr'!AG$1:AG$91,$G7)*I7*$B7,0)","v":{"v":0,"d":"0.0"}},{"$f":"IF(B7,INDEX('2e. Umweltrechner Verkehr'!AH$1:AH$91,$G7)*I7*$B7,0)","v":{"v":0,"d":"0.0"}},{"$f":"IF(B7,INDEX('2e. Umweltrechner Verkehr'!AI$1:AI$91,$G7)*$B7,0)","v":{"v":0,"d":"0.0"}},{"v":0,"d":"0.0"},{"$f":"IF(B7,INDEX('2e. Umweltrechner Verkehr'!AC$1:AC$91,$K7)*$B7,0)","v":{"v":0,"d":"0.0"}},{"$f":"IF(B7,INDEX('2e. Umweltrechner Verkehr'!AD$1:AD$91,$K7)*$B7,0)","v":{"v":0,"d":"0.0"}},{"$f":"IF(B7,INDEX('2e. Umweltrechner Verkehr'!AE$1:AE$91,$K7)*$B7,0)","v":{"v":0,"d":"0.0"}},{"$f":"IF(B7,INDEX('2e. Umweltrechner Verkehr'!AF$1:AF$91,$K7)*$B7,0)","v":{"v":0,"d":"0.0"}},{"$f":"IF(B7,INDEX('2e. Umweltrechner Verkehr'!AG$1:AG$91,$K7)*M7*$B7,0)","v":{"v":0,"d":"0.0"}},{"$f":"IF(B7,INDEX('2e. Umweltrechner Verkehr'!AH$1:AH$91,$K7)*M7*$B7,0)","v":{"v":0,"d":"0.0"}},{"$f":"IF(B7,INDEX('2e. Umweltrechner Verkehr'!AI$1:AI$91,$K7)*$B7,0)","v":{"v":0,"d":"0.0"}},{"v":0,"d":"0.0"}]
["Segment 4",{"$f":"SUM('2. Eingaben Fahrzeug-Ebene'!$D8:$E8)","v":0},{"$f":"'2. Eingaben Fahrzeug-Ebene'!C8","v":0},"Passenger car",{"$f":"IF(B8,INDEX(OFFSET(Grösse,0,1),'2. Eingaben Fahrzeug-Ebene'!G8),\"\")","v":""},"",{"$f":"IF(B8,MATCH(F8,'2e. Umweltrechner Verkehr'!C:C&'2e. Umweltrechner Verkehr'!D:D&'2e. Umweltrechner Verkehr'!I:I,0),0)","v":0},{"$f":"IF(B8,INDEX('2e. Umweltrechner Verkehr'!Q$1:Q$91,$G8),0)","v":0},{"$f":"IF(B8,MIN(H8/'2. Eingaben Fahrzeug-Ebene'!Y8,1),0)","v":{"v":0,"d":"0.00"}},"",{"$f":"IF(B8,MATCH(J8,'2e. Umweltrechner Verkehr'!C:C&'2e. Umweltrechner Verkehr'!D:D&'2e. Umweltrechner Verkehr'!I:I,0),0)","v":0},{"$f":"IF(B8,INDEX('2e. Umweltrechner Verkehr'!Q$1:Q$91,$K8),0)","v":0},{"$f":"IF(B8,MIN(L8/'2. Eingaben Fahrzeug-Ebene'!Y8,1),0)","v":{"v":0,"d":"0.00"}},{"$f":"IF(B8,INDEX('2e. Umweltrechner Verkehr'!AC$1:AC$91,$G8)*$B8,0)","v":{"v":0,"d":"0.0"}},{"$f":"IF(B8,INDEX('2e. Umweltrechner Verkehr'!AD$1:AD$91,$G8)*$B8,0)","v":{"v":0,"d":"0.0"}},{"$f":"IF(B8,INDEX('2e. Umweltrechner Verkehr'!AE$1:AE$91,$G8)*$B8,0)","v":{"v":0,"d":"0.0"}},{"$f":"IF(B8,INDEX('2e. Umweltrechner Verkehr'!AF$1:AF$91,$G8)*$B8,0)","v":{"v":0,"d":"0.0"}},{"$f":"IF(B8,INDEX('2e. Umweltrechner Verkehr'!AG$1:AG$91,$G8)*I8*$B8,0)","v":{"v":0,"d":"0.0"}},{"$f":"IF(B8,INDEX('2e. Umweltrechner Verkehr'!AH$1:AH$91,$G8)*I8*$B8,0)","v":{"v":0,"d":"0.0"}},{"$f":"IF(B8,INDEX('2e. Umweltrechner Verkehr'!AI$1:AI$91,$G8)*$B8,0)","v":{"v":0,"d":"0.0"}},{"v":0,"d":"0.0"},{"$f":"IF(B8,INDEX('2e. Umweltrechner Verkehr'!AC$1:AC$91,$K8)*$B8,0)","v":{"v":0,"d":"0.0"}},{"$f":"IF(B8,INDEX('2e. Umweltrechner Verkehr'!AD$1:AD$91,$K8)*$B8,0)","v":{"v":0,"d":"0.0"}},{"$f":"IF(B8,INDEX('2e. Umweltrechner Verkehr'!AE$1:AE$91,$K8)*$B8,0)","v":{"v":0,"d":"0.0"}},{"$f":"IF(B8,INDEX('2e. Umweltrechner Verkehr'!AF$1:AF$91,$K8)*$B8,0)","v":{"v":0,"d":"0.0"}},{"$f":"IF(B8,INDEX('2e. Umweltrechner Verkehr'!AG$1:AG$91,$K8)*M8*$B8,0)","v":{"v":0,"d":"0.0"}},{"$f":"IF(B8,INDEX('2e. Umweltrechner Verkehr'!AH$1:AH$91,$K8)*M8*$B8,0)","v":{"v":0,"d":"0.0"}},{"$f":"IF(B8,INDEX('2e. Umweltrechner Verkehr'!AI$1:AI$91,$K8)*$B8,0)","v":{"v":0,"d":"0.0"}},{"v":0,"d":"0.0"}]
["Segment 5",{"$f":"SUM('2. Eingaben Fahrzeug-Ebene'!$D9:$E9)","v":0},{"$f":"'2. Eingaben Fahrzeug-Ebene'!C9","v":0},"Passenger car",{"$f":"IF(B9,INDEX(OFFSET(Grösse,0,1),'2. Eingaben Fahrzeug-Ebene'!G9),\"\")","v":""},"",{"$f":"IF(B9,MATCH(F9,'2e. Umweltrechner Verkehr'!C:C&'2e. Umweltrechner Verkehr'!D:D&'2e. Umweltrechner Verkehr'!I:I,0),0)","v":0},{"$f":"IF(B9,INDEX('2e. Umweltrechner Verkehr'!Q$1:Q$91,$G9),0)","v":0},{"$f":"IF(B9,MIN(H9/'2. Eingaben Fahrzeug-Ebene'!Y9,1),0)","v":{"v":0,"d":"0.00"}},"",{"$f":"IF(B9,MATCH(J9,'2e. Umweltrechner Verkehr'!C:C&'2e. Umweltrechner Verkehr'!D:D&'2e. Umweltrechner Verkehr'!I:I,0),0)","v":0},{"$f":"IF(B9,INDEX('2e. Umweltrechner Verkehr'!Q$1:Q$91,$K9),0)","v":0},{"$f":"IF(B9,MIN(L9/'2. Eingaben Fahrzeug-Ebene'!Y9,1),0)","v":{"v":0,"d":"0.00"}},{"$f":"IF(B9,INDEX('2e. Umweltrechner Verkehr'!AC$1:AC$91,$G9)*$B9,0)","v":{"v":0,"d":"0.0"}},{"$f":"IF(B9,INDEX('2e. Umweltrechner Verkehr'!AD$1:AD$91,$G9)*$B9,0)","v":{"v":0,"d":"0.0"}},{"$f":"IF(B9,INDEX('2e. Umweltrechner Verkehr'!AE$1:AE$91,$G9)*$B9,0)","v":{"v":0,"d":"0.0"}},{"$f":"IF(B9,INDEX('2e. Umweltrechner Verkehr'!AF$1:AF$91,$G9)*$B9,0)","v":{"v":0,"d":"0.0"}},{"$f":"IF(B9,INDEX('2e. Umweltrechner Verkehr'!AG$1:AG$91,$G9)*I9*$B9,0)","v":{"v":0,"d":"0.0"}},{"$f":"IF(B9,INDEX('2e. Umweltrechner Verkehr'!AH$1:AH$91,$G9)*I9*$B9,0)","v":{"v":0,"d":"0.0"}},{"$f":"IF(B9,INDEX('2e. Umweltrechner Verkehr'!AI$1:AI$91,$G9)*$B9,0)","v":{"v":0,"d":"0.0"}},{"v":0,"d":"0.0"},{"$f":"IF(B9,INDEX('2e. Umweltrechner Verkehr'!AC$1:AC$91,$K9)*$B9,0)","v":{"v":0,"d":"0.0"}},{"$f":"IF(B9,INDEX('2e. Umweltrechner Verkehr'!AD$1:AD$91,$K9)*$B9,0)","v":{"v":0,"d":"0.0"}},{"$f":"IF(B9,INDEX('2e. Umweltrechner Verkehr'!AE$1:AE$91,$K9)*$B9,0)","v":{"v":0,"d":"0.0"}},{"$f":"IF(B9,INDEX('2e. Umweltrechner Verkehr'!AF$1:AF$91,$K9)*$B9,0)","v":{"v":0,"d":"0.0"}},{"$f":"IF(B9,INDEX('2e. Umweltrechner Verkehr'!AG$1:AG$91,$K9)*M9*$B9,0)","v":{"v":0,"d":"0.0"}},{"$f":"IF(B9,INDEX('2e. Umweltrechner Verkehr'!AH$1:AH$91,$K9)*M9*$B9,0)","v":{"v":0,"d":"0.0"}},{"$f":"IF(B9,INDEX('2e. Umweltrechner Verkehr'!AI$1:AI$91,$K9)*$B9,0)","v":{"v":0,"d":"0.0"}},{"v":0,"d":"0.0"}]
["Segment 6",{"$f":"SUM('2. Eingaben Fahrzeug-Ebene'!$D10:$E10)","v":0},{"$f":"'2. Eingaben Fahrzeug-Ebene'!C10","v":0},"Passenger car",{"$f":"IF(B10,INDEX(OFFSET(Grösse,0,1),'2. Eingaben Fahrzeug-Ebene'!G10),\"\")","v":""},"",{"$f":"IF(B10,MATCH(F10,'2e. Umweltrechner Verkehr'!C:C&'2e. Umweltrechner Verkehr'!D:D&'2e. Umweltrechner Verkehr'!I:I,0),0)","v":0},{"$f":"IF(B10,INDEX('2e. Umweltrechner Verkehr'!Q$1:Q$91,$G10),0)","v":0},{"$f":"IF(B10,MIN(H10/'2. Eingaben Fahrzeug-Ebene'!Y10,1),0)","v":{"v":0,"d":"0.00"}},"",{"$f":"IF(B10,MATCH(J10,'2e. Umweltrechner Verkehr'!C:C&'2e. Umweltrechner Verkehr'!D:D&'2e. Umweltrechner Verkehr'!I:I,0),0)","v":0},{"$f":"IF(B10,INDEX('2e. Umweltrechner Verkehr'!Q$1:Q$91,$K10),0)","v":0},{"$f":"IF(B10,MIN(L10/'2. Eingaben Fahrzeug-Ebene'!Y10,1),0)","v":{"v":0,"d":"0.00"}},{"$f":"IF(B10,INDEX('2e. Umweltrechner Verkehr'!AC$1:AC$91,$G10)*$B10,0)","v":{"v":0,"d":"0.0"}},{"$f":"IF(B10,INDEX('2e. Umweltrechner Verkehr'!AD$1:AD$91,$G10)*$B10,0)","v":{"v":0,"d":"0.0"}},{"$f":"IF(B10,INDEX('2e. Umweltrechner Verkehr'!AE$1:AE$91,$G10)*$B10,0)","v":{"v":0,"d":"0.0"}},{"$f":"IF(B10,INDEX('2e. Umweltrechner Verkehr'!AF$1:AF$91,$G10)*$B10,0)","v":{"v":0,"d":"0.0"}},{"$f":"IF(B10,INDEX('2e. Umweltrechner Verkehr'!AG$1:AG$91,$G10)*I10*$B10,0)","v":{"v":0,"d":"0.0"}},{"$f":"IF(B10,INDEX('2e. Umweltrechner Verkehr'!AH$1:AH$91,$G10)*I10*$B10,0)","v":{"v":0,"d":"0.0"}},{"$f":"IF(B10,INDEX('2e. Umweltrechner Verkehr'!AI$1:AI$91,$G10)*$B10,0)","v":{"v":0,"d":"0.0"}},{"v":0,"d":"0.0"},{"$f":"IF(B10,INDEX('2e. Umweltrechner Verkehr'!AC$1:AC$91,$K10)*$B10,0)","v":{"v":0,"d":"0.0"}},{"$f":"IF(B10,INDEX('2e. Umweltrechner Verkehr'!AD$1:AD$91,$K10)*$B10,0)","v":{"v":0,"d":"0.0"}},{"$f":"IF(B10,INDEX('2e. Umweltrechner Verkehr'!AE$1:AE$91,$K10)*$B10,0)","v":{"v":0,"d":"0.0"}},{"$f":"IF(B10,INDEX('2e. Umweltrechner Verkehr'!AF$1:AF$91,$K10)*$B10,0)","v":{"v":0,"d":"0.0"}},{"$f":"IF(B10,INDEX('2e. Umweltrechner Verkehr'!AG$1:AG$91,$K10)*M10*$B10,0)","v":{"v":0,"d":"0.0"}},{"$f":"IF(B10,INDEX('2e. Umweltrechner Verkehr'!AH$1:AH$91,$K10)*M10*$B10,0)","v":{"v":0,"d":"0.0"}},{"$f":"IF(B10,INDEX('2e. Umweltrechner Verkehr'!AI$1:AI$91,$K10)*$B10,0)","v":{"v":0,"d":"0.0"}},{"v":0,"d":"0.0"}]
["Segment 7",{"$f":"SUM('2. Eingaben Fahrzeug-Ebene'!$D11:$E11)","v":0},{"$f":"'2. Eingaben Fahrzeug-Ebene'!C11","v":0},"Passenger car",{"$f":"IF(B11,INDEX(OFFSET(Grösse,0,1),'2. Eingaben Fahrzeug-Ebene'!G11),\"\")","v":""},"",{"$f":"IF(B11,MATCH(F11,'2e. Umweltrechner Verkehr'!C:C&'2e. Umweltrechner Verkehr'!D:D&'2e. Umweltrechner Verkehr'!I:I,0),0)","v":0},{"$f":"IF(B11,INDEX('2e. Umweltrechner Verkehr'!Q$1:Q$91,$G11),0)","v":0},{"$f":"IF(B11,MIN(H11/'2. Eingaben Fahrzeug-Ebene'!Y11,1),0)","v":{"v":0,"d":"0.00"}},"",{"$f":"IF(B11,MATCH(J11,'2e. Umweltrechner Verkehr'!C:C&'2e. Umweltrechner Verkehr'!D:D&'2e. Umweltrechner Verkehr'!I:I,0),0)","v":0},{"$f":"IF(B11,INDEX('2e. Umweltrechner Verkehr'!Q$1:Q$91,$K11),0)","v":0},{"$f":"IF(B11,MIN(L11/'2. Eingaben Fahrzeug-Ebene'!Y11,1),0)","v":{"v":0,"d":"0.00"}},{"$f":"IF(B11,INDEX('2e. Umweltrechner Verkehr'!AC$1:AC$91,$G11)*$B11,0)","v":{"v":0,"d":"0.0"}},{"$f":"IF(B11,INDEX('2e. Umweltrechner Verkehr'!AD$1:AD$91,$G11)*$B11,0)","v":{"v":0,"d":"0.0"}},{"$f":"IF(B11,INDEX('2e. Umweltrechner Verkehr'!AE$1:AE$91,$G11)*$B11,0)","v":{"v":0,"d":"0.0"}},{"$f":"IF(B11,INDEX('2e. Umweltrechner Verkehr'!AF$1:AF$91,$G11)*$B11,0)","v":{"v":0,"d":"0.0"}},{"$f":"IF(B11,INDEX('2e. Umweltrechner Verkehr'!AG$1:AG$91,$G11)*I11*$B11,0)","v":{"v":0,"d":"0.0"}},{"$f":"IF(B11,INDEX('2e. Umweltrechner Verkehr'!AH$1:AH$91,$G11)*I11*$B11,0)","v":{"v":0,"d":"0.0"}},{"$f":"IF(B11,INDEX('2e. Umweltrechner Verkehr'!AI$1:AI$91,$G11)*$B11,0)","v":{"v":0,"d":"0.0"}},{"v":0,"d":"0.0"},{"$f":"IF(B11,INDEX('2e. Umweltrechner Verkehr'!AC$1:AC$91,$K11)*$B11,0)","v":{"v":0,"d":"0.0"}},{"$f":"IF(B11,INDEX('2e. Umweltrechner Verkehr'!AD$1:AD$91,$K11)*$B11,0)","v":{"v":0,"d":"0.0"}},{"$f":"IF(B11,INDEX('2e. Umweltrechner Verkehr'!AE$1:AE$91,$K11)*$B11,0)","v":{"v":0,"d":"0.0"}},{"$f":"IF(B11,INDEX('2e. Umweltrechner Verkehr'!AF$1:AF$91,$K11)*$B11,0)","v":{"v":0,"d":"0.0"}},{"$f":"IF(B11,INDEX('2e. Umweltrechner Verkehr'!AG$1:AG$91,$K11)*M11*$B11,0)","v":{"v":0,"d":"0.0"}},{"$f":"IF(B11,INDEX('2e. Umweltrechner Verkehr'!AH$1:AH$91,$K11)*M11*$B11,0)","v":{"v":0,"d":"0.0"}},{"$f":"IF(B11,INDEX('2e. Umweltrechner Verkehr'!AI$1:AI$91,$K11)*$B11,0)","v":{"v":0,"d":"0.0"}},{"v":0,"d":"0.0"}]
["Segment 8",{"$f":"SUM('2. Eingaben Fahrzeug-Ebene'!$D12:$E12)","v":0},{"$f":"'2. Eingaben Fahrzeug-Ebene'!C12","v":0},"Passenger car",{"$f":"IF(B12,INDEX(OFFSET(Grösse,0,1),'2. Eingaben Fahrzeug-Ebene'!G12),\"\")","v":""},"",{"$f":"IF(B12,MATCH(F12,'2e. Umweltrechner Verkehr'!C:C&'2e. Umweltrechner Verkehr'!D:D&'2e. Umweltrechner Verkehr'!I:I,0),0)","v":0},{"$f":"IF(B12,INDEX('2e. Umweltrechner Verkehr'!Q$1:Q$91,$G12),0)","v":0},{"$f":"IF(B12,MIN(H12/'2. Eingaben Fahrzeug-Ebene'!Y12,1),0)","v":{"v":0,"d":"0.00"}},"",{"$f":"IF(B12,MATCH(J12,'2e. Umweltrechner Verkehr'!C:C&'2e. Umweltrechner Verkehr'!D:D&'2e. Umweltrechner Verkehr'!I:I,0),0)","v":0},{"$f":"IF(B12,INDEX('2e. Umweltrechner Verkehr'!Q$1:Q$91,$K12),0)","v":0},{"$f":"IF(B12,MIN(L12/'2. Eingaben Fahrzeug-Ebene'!Y12,1),0)","v":{"v":0,"d":"0.00"}},{"$f":"IF(B12,INDEX('2e. Umweltrechner Verkehr'!AC$1:AC$91,$G12)*$B12,0)","v":{"v":0,"d":"0.0"}},{"$f":"IF(B12,INDEX('2e. Umweltrechner Verkehr'!AD$1:AD$91,$G12)*$B12,0)","v":{"v":0,"d":"0.0"}},{"$f":"IF(B12,INDEX('2e. Umweltrechner Verkehr'!AE$1:AE$91,$G12)*$B12,0)","v":{"v":0,"d":"0.0"}},{"$f":"IF(B12,INDEX('2e. Umweltrechner Verkehr'!AF$1:AF$91,$G12)*$B12,0)","v":{"v":0,"d":"0.0"}},{"$f":"IF(B12,INDEX('2e. Umweltrechner Verkehr'!AG$1:AG$91,$G12)*I12*$B12,0)","v":{"v":0,"d":"0.0"}},{"$f":"IF(B12,INDEX('2e. Umweltrechner Verkehr'!AH$1:AH$91,$G12)*I12*$B12,0)","v":{"v":0,"d":"0.0"}},{"$f":"IF(B12,INDEX('2e. Umweltrechner Verkehr'!AI$1:AI$91,$G12)*$B12,0)","v":{"v":0,"d":"0.0"}},{"v":0,"d":"0.0"},{"$f":"IF(B12,INDEX('2e. Umweltrechner Verkehr'!AC$1:AC$91,$K12)*$B12,0)","v":{"v":0,"d":"0.0"}},{"$f":"IF(B12,INDEX('2e. Umweltrechner Verkehr'!AD$1:AD$91,$K12)*$B12,0)","v":{"v":0,"d":"0.0"}},{"$f":"IF(B12,INDEX('2e. Umweltrechner Verkehr'!AE$1:AE$91,$K12)*$B12,0)","v":{"v":0,"d":"0.0"}},{"$f":"IF(B12,INDEX('2e. Umweltrechner Verkehr'!AF$1:AF$91,$K12)*$B12,0)","v":{"v":0,"d":"0.0"}},{"$f":"IF(B12,INDEX('2e. Umweltrechner Verkehr'!AG$1:AG$91,$K12)*M12*$B12,0)","v":{"v":0,"d":"0.0"}},{"$f":"IF(B12,INDEX('2e. Umweltrechner Verkehr'!AH$1:AH$91,$K12)*M12*$B12,0)","v":{"v":0,"d":"0.0"}},{"$f":"IF(B12,INDEX('2e. Umweltrechner Verkehr'!AI$1:AI$91,$K12)*$B12,0)","v":{"v":0,"d":"0.0"}},{"v":0,"d":"0.0"}]
["Segment 9",{"$f":"SUM('2. Eingaben Fahrzeug-Ebene'!$D13:$E13)","v":0},{"$f":"'2. Eingaben Fahrzeug-Ebene'!C13","v":0},"Passenger car",{"$f":"IF(B13,INDEX(OFFSET(Grösse,0,1),'2. Eingaben Fahrzeug-Ebene'!G13),\"\")","v":""},"",{"$f":"IF(B13,MATCH(F13,'2e. Umweltrechner Verkehr'!C:C&'2e. Umweltrechner Verkehr'!D:D&'2e. Umweltrechner Verkehr'!I:I,0),0)","v":0},{"$f":"IF(B13,INDEX('2e. Umweltrechner Verkehr'!Q$1:Q$91,$G13),0)","v":0},{"$f":"IF(B13,MIN(H13/'2. Eingaben Fahrzeug-Ebene'!Y13,1),0)","v":{"v":0,"d":"0.00"}},"",{"$f":"IF(B13,MATCH(J13,'2e. Umweltrechner Verkehr'!C:C&'2e. Umweltrechner Verkehr'!D:D&'2e. Umweltrechner Verkehr'!I:I,0),0)","v":0},{"$f":"IF(B13,INDEX('2e. Umweltrechner Verkehr'!Q$1:Q$91,$K13),0)","v":0},{"$f":"IF(B13,MIN(L13/'2. Eingaben Fahrzeug-Ebene'!Y13,1),0)","v":{"v":0,"d":"0.00"}},{"$f":"IF(B13,INDEX('2e. Umweltrechner Verkehr'!AC$1:AC$91,$G13)*$B13,0)","v":{"v":0,"d":"0.0"}},{"$f":"IF(B13,INDEX('2e. Umweltrechner Verkehr'!AD$1:AD$91,$G13)*$B13,0)","v":{"v":0,"d":"0.0"}},{"$f":"IF(B13,INDEX('2e. Umweltrechner Verkehr'!AE$1:AE$91,$G13)*$B13,0)","v":{"v":0,"d":"0.0"}},{"$f":"IF(B13,INDEX('2e. Umweltrechner Verkehr'!AF$1:AF$91,$G13)*$B13,0)","v":{"v":0,"d":"0.0"}},{"$f":"IF(B13,INDEX('2e. Umweltrechner Verkehr'!AG$1:AG$91,$G13)*I13*$B13,0)","v":{"v":0,"d":"0.0"}},{"$f":"IF(B13,INDEX('2e. Umweltrechner Verkehr'!AH$1:AH$91,$G13)*I13*$B13,0)","v":{"v":0,"d":"0.0"}},{"$f":"IF(B13,INDEX('2e. Umweltrechner Verkehr'!AI$1:AI$91,$G13)*$B13,0)","v":{"v":0,"d":"0.0"}},{"v":0,"d":"0.0"},{"$f":"IF(B13,INDEX('2e. Umweltrechner Verkehr'!AC$1:AC$91,$K13)*$B13,0)","v":{"v":0,"d":"0.0"}},{"$f":"IF(B13,INDEX('2e. Umweltrechner Verkehr'!AD$1:AD$91,$K13)*$B13,0)","v":{"v":0,"d":"0.0"}},{"$f":"IF(B13,INDEX('2e. Umweltrechner Verkehr'!AE$1:AE$91,$K13)*$B13,0)","v":{"v":0,"d":"0.0"}},{"$f":"IF(B13,INDEX('2e. Umweltrechner Verkehr'!AF$1:AF$91,$K13)*$B13,0)","v":{"v":0,"d":"0.0"}},{"$f":"IF(B13,INDEX('2e. Umweltrechner Verkehr'!AG$1:AG$91,$K13)*M13*$B13,0)","v":{"v":0,"d":"0.0"}},{"$f":"IF(B13,INDEX('2e. Umweltrechner Verkehr'!AH$1:AH$91,$K13)*M13*$B13,0)","v":{"v":0,"d":"0.0"}},{"$f":"IF(B13,INDEX('2e. Umweltrechner Verkehr'!AI$1:AI$91,$K13)*$B13,0)","v":{"v":0,"d":"0.0"}},{"v":0,"d":"0.0"}]
["Segment 10",{"$f":"SUM('2. Eingaben Fahrzeug-Ebene'!$D14:$E14)","v":0},{"$f":"'2. Eingaben Fahrzeug-Ebene'!C14","v":0},"Passenger car",{"$f":"IF(B14,INDEX(OFFSET(Grösse,0,1),'2. Eingaben Fahrzeug-Ebene'!G14),\"\")","v":""},"",{"$f":"IF(B14,MATCH(F14,'2e. Umweltrechner Verkehr'!C:C&'2e. Umweltrechner Verkehr'!D:D&'2e. Umweltrechner Verkehr'!I:I,0),0)","v":0},{"$f":"IF(B14,INDEX('2e. Umweltrechner Verkehr'!Q$1:Q$91,$G14),0)","v":0},{"$f":"IF(B14,MIN(H14/'2. Eingaben Fahrzeug-Ebene'!Y14,1),0)","v":{"v":0,"d":"0.00"}},"",{"$f":"IF(B14,MATCH(J14,'2e. Umweltrechner Verkehr'!C:C&'2e. Umweltrechner Verkehr'!D:D&'2e. Umweltrechner Verkehr'!I:I,0),0)","v":0},{"$f":"IF(B14,INDEX('2e. Umweltrechner Verkehr'!Q$1:Q$91,$K14),0)","v":0},{"$f":"IF(B14,MIN(L14/'2. Eingaben Fahrzeug-Ebene'!Y14,1),0)","v":{"v":0,"d":"0.00"}},{"$f":"IF(B14,INDEX('2e. Umweltrechner Verkehr'!AC$1:AC$91,$G14)*$B14,0)","v":{"v":0,"d":"0.0"}},{"$f":"IF(B14,INDEX('2e. Umweltrechner Verkehr'!AD$1:AD$91,$G14)*$B14,0)","v":{"v":0,"d":"0.0"}},{"$f":"IF(B14,INDEX('2e. Umweltrechner Verkehr'!AE$1:AE$91,$G14)*$B14,0)","v":{"v":0,"d":"0.0"}},{"$f":"IF(B14,INDEX('2e. Umweltrechner Verkehr'!AF$1:AF$91,$G14)*$B14,0)","v":{"v":0,"d":"0.0"}},{"$f":"IF(B14,INDEX('2e. Umweltrechner Verkehr'!AG$1:AG$91,$G14)*I14*$B14,0)","v":{"v":0,"d":"0.0"}},{"$f":"IF(B14,INDEX('2e. Umweltrechner Verkehr'!AH$1:AH$91,$G14)*I14*$B14,0)","v":{"v":0,"d":"0.0"}},{"$f":"IF(B14,INDEX('2e. Umweltrechner Verkehr'!AI$1:AI$91,$G14)*$B14,0)","v":{"v":0,"d":"0.0"}},{"v":0,"d":"0.0"},{"$f":"IF(B14,INDEX('2e. Umweltrechner Verkehr'!AC$1:AC$91,$K14)*$B14,0)","v":{"v":0,"d":"0.0"}},{"$f":"IF(B14,INDEX('2e. Umweltrechner Verkehr'!AD$1:AD$91,$K14)*$B14,0)","v":{"v":0,"d":"0.0"}},{"$f":"IF(B14,INDEX('2e. Umweltrechner Verkehr'!AE$1:AE$91,$K14)*$B14,0)","v":{"v":0,"d":"0.0"}},{"$f":"IF(B14,INDEX('2e. Umweltrechner Verkehr'!AF$1:AF$91,$K14)*$B14,0)","v":{"v":0,"d":"0.0"}},{"$f":"IF(B14,INDEX('2e. Umweltrechner Verkehr'!AG$1:AG$91,$K14)*M14*$B14,0)","v":{"v":0,"d":"0.0"}},{"$f":"IF(B14,INDEX('2e. Umweltrechner Verkehr'!AH$1:AH$91,$K14)*M14*$B14,0)","v":{"v":0,"d":"0.0"}},{"$f":"IF(B14,INDEX('2e. Umweltrechner Verkehr'!AI$1:AI$91,$K14)*$B14,0)","v":{"v":0,"d":"0.0"}},{"v":0,"d":"0.0"}]

{"sheet":"2d. Annahmen","index":12,"n_rows":91,"n_cols":14,"rows_kept":91,"hidden":true,"merged":[[74,1,74,6]]}
["Fahrzeug Annahmen"]
["*Umweltrechner Verkehr",{"$nulls":4},"E-Fahrzeug",{"v":0.8,"d":"80%"}]
[{"$nulls":5},"Batteriekapazität, netto (kWh)","Batteriekapazität, nutzbar (kWh)","Verbrauch (kWh/100 km)","Lebensfahrleistung (km)","Anschaffungskosten Faktor","Anschaffungskosten (CHF)","Reifen (CHF/Jahr)","Service/Unterhalt (CHF/Jahr)","Δ Restwert "]
["Personenwagen",{"$f":"Grösse","v":"Kleinwagen"},"BEV","Passenger carBEVCompact",{"$f":"MATCH(D4,'2e. Umweltrechner Verkehr'!C:C&'2e. Umweltrechner Verkehr'!D:D&'2e. Umweltrechner Verkehr'!I:I,0)","v":2},{"v":46.46,"d":"46.5"},{"$f":"F4*$G$2","v":{"v":37.168,"d":"37.2"}},{"$f":"INDEX('2e. Umweltrechner Verkehr'!V:V,$E4)","v":14.9},{"$f":"INDEX('2e. Umweltrechner Verkehr'!Q:Q,$E4)","v":200000},{"$f":"K4/H13-1","v":{"v":0.34352909933060993,"d":"34%"}},{"$f":"28668*(1-$B$29)","v":{"v":25801.2,"d":"25,801"}},350,455,{"v":-0.02,"d":"-2.0%"}]
["Personenwagen","Mittelklasse","BEV","Passenger carBEVMedium",{"$f":"MATCH(D5,'2e. Umweltrechner Verkehr'!C:C&'2e. Umweltrechner Verkehr'!D:D&'2e. Umweltrechner Verkehr'!I:I,0)","v":3},{"v":58.625,"d":"58.6"},{"$f":"F5*$G$2","v":{"v":46.900000000000006,"d":"46.9"}},{"$f":"INDEX('2e. Umweltrechner Verkehr'!V:V,$E5)","v":15.1},{"$f":"INDEX('2e. Umweltrechner Verkehr'!Q:Q,$E5)","v":200000},{"$f":"K5/H14-1","v":{"v":-3.3725864927902638E-4,"d":"-0%"}},{"$f":"35569*(1-$B$29)","v":{"v":32012.100000000002,"d":"32,012"}},470,650,{"v":-0.03,"d":"-3.0%"}]
["Personenwagen","Oberklasse","BEV","Passenger carBEVLarge",{"$f":"MATCH(D6,'2e. Umweltrechner Verkehr'!C:C&'2e. Umweltrechner Verkehr'!D:D&'2e. Umweltrechner Verkehr'!I:I,0)","v":4},{"v":99.65,"d":"99.7"},{"v":79.72000000000001,"d":"79.7"},{"$f":"INDEX('2e. Umweltrechner Verkehr'!V:V,$E6)","v":16.3},{"$f":"INDEX('2e. Umweltrechner Verkehr'!Q:Q,$E6)","v":200000},{"v":0.01803055642743212,"d":"2%"},{"$f":"83428*(1-$B$29)","v":{"v":75085.2,"d":"75,085"}},750,{"v":1000,"d":"1,000"},{"v":-0.04,"d":"-4.0%"}]
["Personenwagen","SUV","BEV","Passenger carBEVSUV",{"$f":"MATCH(D7,'2e. Umweltrechner Verkehr'!C:C&'2e. Umweltrechner Verkehr'!D:D&'2e. Umweltrechner Verkehr'!I:I,0)","v":5},{"v":71.76,"d":"71.8"},{"v":57.40800000000001,"d":"57.4"},{"$f":"INDEX('2e. Umweltrechner Verkehr'!V:V,$E7)","v":16.4},{"$f":"INDEX('2e. Umweltrechner Verkehr'!Q:Q,$E7)","v":200000},{"v":0.1809020084339934,"d":"18%"},{"$f":"49566*(1-$B$29)","v":{"v":44609.4,"d":"44,609"}},590,850,{"v":-0.035,"d":"-3.5%"}]
[]
[{"$nulls":5},"Verbrauchskatalog","Verbrauchskatalog","Verbrauchskatalog","Umweltrechner Verkehr","sffv","BFE TCO Studie","sffv","sffv"]
[{"$nulls":10},"news.admin.ch/de/nsb?id=93890",null,"Bsp. 20‘000km/p.a. 48 Mt. LZ"]
[{"$nulls":5},"Verbrenner"]
[{"$nulls":5},"Verbrauch (l/100 km)","Lebensfahrleistung (km)","Anschaffungskosten (CHF)","Reifen (CHF/Jahr)","Service/Unterhalt (CHF/Jahr)","Δ Restwert "]
["Personenwagen",{"$f":"Grösse","v":"Kleinwagen"},"ICEV-p","Passenger carICEV-pCompact",{"$f":"MATCH(D13,'2e. Umweltrechner Verkehr'!C:C&'2e. Umweltrechner Verkehr'!D:D&'2e. Umweltrechner Verkehr'!I:I,0)","v":6},{"$f":"INDEX('2e. Umweltrechner Verkehr'!U:U,$E13)","v":5.4},{"$f":"INDEX('2e. Umweltrechner Verkehr'!Q:Q,$E13)","v":200000},{"$f":"22593*(1-$B$30)","v":{"v":19204.05,"d":"19,204"}},300,700,{"v":0.015,"d":"1.5%"}]
["Personenwagen","Mittelklasse","ICEV-p","Passenger carICEV-pMedium",{"$f":"MATCH(D14,'2e. Umweltrechner Verkehr'!C:C&'2e. Umweltrechner Verkehr'!D:D&'2e. Umweltrechner Verkehr'!I:I,0)","v":7},{"$f":"INDEX('2e. Umweltrechner Verkehr'!U:U,$E14)","v":5.8},{"$f":"INDEX('2e. Umweltrechner Verkehr'!Q:Q,$E14)","v":200000},{"$f":"37674*(1-$B$30)","v":{"v":32022.899999999998,"d":"32,023"}},400,{"v":1000,"d":"1,000"},{"v":0,"d":"0.0%"}]
["Personenwagen","Oberklasse","ICEV-p","Passenger carICEV-pLarge",{"$f":"MATCH(D15,'2e. Umweltrechner Verkehr'!C:C&'2e. Umweltrechner Verkehr'!D:D&'2e. Umweltrechner Verkehr'!I:I,0)","v":8},{"$f":"INDEX('2e. Umweltrechner Verkehr'!U:U,$E15)","v":{"v":8,"d":"8.0"}},{"$f":"INDEX('2e. Umweltrechner Verkehr'!Q:Q,$E15)","v":200000},{"$f":"86771*(1-$B$30)","v":{"v":73755.34999999999,"d":"73,755"}},650,{"v":1500,"d":"1,500"},{"v":-0.02,"d":"-2.0%"}]
["Personenwagen","SUV","ICEV-p","Passenger carICEV-pSUV",{"$f":"MATCH(D16,'2e. Umweltrechner Verkehr'!C:C&'2e. Umweltrechner Verkehr'!D:D&'2e. Umweltrechner Verkehr'!I:I,0)","v":9},{"$f":"INDEX('2e. Umweltrechner Verkehr'!U:U,$E16)","v":6.7},{"$f":"INDEX('2e. Umweltrechner Verkehr'!Q:Q,$E16)","v":200000},{"$f":"44442*(1-$B$30)","v":{"v":37775.7,"d":"37,776"}},500,{"v":1300,"d":"1,300"},{"v":-0.01,"d":"-1.0%"}]
[]
[{"$nulls":5},"Verbrauchskatalog","Umweltrechner Verkehr","BFE TCO Studie","sffv","sffv"]
[{"$nulls":7},"news.admin.ch/de/nsb?id=93890",null,"Bsp. 20‘000km/p.a. 48 Mt. LZ"]
[null,null,"E-Fahrzeug & Verbrenner"]
[null,null,"Versicherung (CHF/Jahr)","Flottenverwaltung (CHF/Jahr)"]
["Personenwagen",{"$f":"Grösse","v":"Kleinwagen"},900,400]
["Personenwagen","Mittelklasse",{"v":1200,"d":"1,200"},400]
["Personenwagen","Oberklasse",{"v":2000,"d":"2,000"},400]
["Personenwagen","SUV",{"v":1500,"d":"1,500"},400]
[]
[null,null,"sffv","sffv"]
[]
["Rabatt E-Fzg",{"v":0.1,"d":"10%"}]
["Rabatt Verbrenner",{"v":0.15,"d":"15%"}]
[]
["Ladeinfrastruktur Annahmen"]
["Ladepunkte"]
[]
["Kosten pro Ladepunkt",null,null,"*Basisdaten (aus 4018a)",null,null,"Annahme 2x LP pro LS"]
["Ladepunkt Leistung","Kosten pro LP",null,null,"Ladestation Leistung","Typ","Ladepunkt Leistung","Kosten"]
["[kW]","CHF",{"$nulls":5},"Ladestation mit 2 LP","Installation pro LS","Gesamttotal","Gesamttotal pro LP"]
[{"$f":"Ladeleistung","v":11},{"$f":"$K$38*0.8*1.2","v":{"v":1632,"d":"1,632"}},null,null,22,"AC",{"$f":"E38","v":22},{"v":1400,"d":"1,400"},300,{"$f":"SUM(H38:I38)","v":{"v":1700,"d":"1,700"}},{"$f":"J38","v":{"v":1700,"d":"1,700"}}]
[22,{"$f":"$K$38*1.2","v":{"v":2040,"d":"2,040"}},null,null,75,"DC",{"$f":"E39/2","v":37.5},{"v":31500,"d":"31,500"},{"v":1600,"d":"1,600"},{"$f":"SUM(H39:I39)","v":{"v":33100,"d":"33,100"}},{"$f":"J39/2","v":{"v":16550,"d":"16,550"}}]
[50,{"$f":"(7726+253.32*A40-0.3599*(A40)^2)*1.2","v":{"v":23390.7,"d":"23,391"}},null,null,150,"DC",75,{"v":48000,"d":"48,000"},{"v":2000,"d":"2,000"},{"$f":"SUM(H40:I40)","v":{"v":50000,"d":"50,000"}},{"$f":"J40/2","v":{"v":25000,"d":"25,000"}}]
[66,{"$f":"(7726+253.32*A41-0.3599*(A41)^2)*1.2","v":{"v":27452.87472,"d":"27,453"}},null,null,180,"DC",90,{"v":53500,"d":"53,500"},{"v":2000,"d":"2,000"},{"v":55500,"d":"55,500"},{"v":27750,"d":"27,750"}]
[75,{"v":29640.675,"d":"29,641"},null,null,225,"DC",112.5,{"v":61000,"d":"61,000"},{"v":2000,"d":"2,000"},{"v":63000,"d":"63,000"},{"v":31500,"d":"31,500"}]
[100,{"v":35350.799999999996,"d":"35,351"},null,null,250,"DC",125,{"v":66000,"d":"66,000"},{"v":2000,"d":"2,000"},{"v":68000,"d":"68,000"},{"v":34000,"d":"34,000"}]
[120,{"v":39530.20799999999,"d":"39,530"},null,null,275,"DC",137.5,{"v":68500,"d":"68,500"},{"v":2000,"d":"2,000"},{"v":70500,"d":"70,500"},{"v":35250,"d":"35,250"}]
[150,{"v":45151.5,"d":"45,152"},null,null,320,"DC",160,{"v":76000,"d":"76,000"},{"v":2000,"d":"2,000"},{"v":78000,"d":"78,000"},{"v":39000,"d":"39,000"}]
[180,{"v":49995.407999999996,"d":"49,995"},null,null,350,"DC",175,{"v":80500,"d":"80,500"},{"v":2000,"d":"2,000"},{"v":82500,"d":"82,500"},{"v":41250,"d":"41,250"}]
[200,{"v":52792.799999999996,"d":"52,793"}]
[225,{"v":55803.674999999996,"d":"55,804"}]
[250,{"v":58274.7,"d":"58,275"}]
[]
[]
[]
["Sonstige Annahmen",{"$nulls":4},"Quelle:"]
["Lebensdauer",10,"Jahren",null,null,"Ladeinfrastruktur in Mietobjekten","78059.pdf"]
["Unterhaltkosten (pro Jahr)",{"v":0.015,"d":"1.5%"},null,"(als % of LP-Anschaffungskosten)",null,"Ladeinfrastruktur in Mietobjekten"]
["Wirkungsgrad",{"v":0.9,"d":"90%"},null,"(Stromnetz --> Fahrzeug)",null,"4018a","Ladeverluste beim Elektroauto: So viel geht beim Laden verloren",null,null,"swisscharge"]
["Wirkungsgrad",{"v":0.95,"d":"95%"},null,"(Fahrzeug --> Batterie)",null,null,"Ladeverluste beim Elektroauto: So viel geht beim Laden verloren"]
[]
["Netzanschluss"]
["Fixkosten",50000,"CHF",130000,"CHF","4018a"]
["Variablekosten",200,"CHF/kVA",256.25,"CHF/kVA","4018a"]
["Lebensdauer",20,"Jahren",null,null,"Ladeinfrastruktur in Mietobjekten","78059.pdf"]
[]
["Basisinfrastruktur","Firmenstandort (AC)","Firmenstandort (DC, <150 kW)","Firmenstandort (DC, ≥150 kW)",null,"Wohnort"]
["Fixkosten",2000,8500,15000,"CHF",0,"CHF"]
["Variablekosten",1000,3000,3000,"CHF/LP",1000,"CHF"]
[]
["Energiekosten"]
["Stromtarif (Variable)",{"v":0,"d":"0.00"},"CHF/kW / Monat",null,null,"Stromtarife – Niedertarife & Hochtarife in Zürich & Graubünden"]
[]
[]
["Fahrzeugkosten"]
["sffv"]
["Fahrzeug Restwert (Verbrenner)"]
[null,"Kilometer"]
["Laufzeit",10000,15000,20000,25000,30000,35000]
[12,{"v":0.6861486111111111,"d":"69%"},{"v":0.6752222222222223,"d":"68%"},{"v":0.6642958333333334,"d":"66%"},{"v":0.6518097222222222,"d":"65%"},{"v":0.6330791666666666,"d":"63%"},{"v":0.6143486111111112,"d":"61%"}]
[24,{"v":0.6317041666666667,"d":"63%"},{"v":0.6124444444444445,"d":"61%"},{"v":0.5931847222222223,"d":"59%"},{"v":0.571175,"d":"57%"},{"v":0.5381583333333334,"d":"54%"},{"v":0.5051430555555556,"d":"51%"}]
[36,{"v":0.57,"d":"57%"},{"v":0.545,"d":"55%"},{"v":0.52,"d":"52%"},{"v":0.4914291666666667,"d":"49%"},{"v":0.44857083333333336,"d":"45%"},{"v":0.40571388888888893,"d":"41%"}]
[48,{"v":0.5010375,"d":"50%"},{"v":0.4728888888888889,"d":"47%"},{"v":0.4447402777777778,"d":"44%"},{"v":0.41257083333333333,"d":"41%"},{"v":0.3643180555555556,"d":"36%"},{"v":0.31606388888888887,"d":"32%"}]
[60,{"v":0.4008333333333334,"d":"40%"},{"v":0.37375,"d":"37%"},{"v":0.34666666666666673,"d":"35%"},{"v":0.3148805555555556,"d":"31%"},{"v":0.2692861111111111,"d":"27%"},{"v":0.22285694444444445,"d":"22%"}]
[72,{"v":0.28444444444444444,"d":"28%"},{"v":0.26222222222222225,"d":"26%"},{"v":0.24,"d":"24%"},{"v":0.2146027777777778,"d":"21%"},{"v":0.17650833333333335,"d":"18%"},{"v":0.13841250000000002,"d":"14%"}]
[]
[]
["Berechnet, TCO Studie und Umweltrechner Verkehr"]
[]
[null,"Batteriegrösse (brutto, kWh)","Batteriegrösse (netto, kWh)","Verbrauch (kWh/100 km)"]
["Kleinwagen",49,46.46,14.850000000000001]
["Mittelklasse",60.5,58.625,15.1]
["Oberklasse",91.95,99.65,16.3]
["SUV",78.125,71.76,16.380000000000003]

{"sheet":"2e. Umweltrechner Verkehr","index":13,"n_rows":9,"n_cols":84,"rows_kept":9,"hidden":true}
["name","type","subtype","powertrain","description","further_description","speed","powerClass","size","geography","trafficCharacteristics","year","emissionStandard","id","amount [FU]","functionalUnit","lifetimeKilometers [km]","kilometersPerYear [km/a]","passengers","cargoMass [kg]","fuelConsumption [l/100km] / [kg/100km]","electricityConsumption [kWh/100km]","electricEnergyStored [kWh]","batteryLifetimeReplacements","fuelCellLifetimeReplacements","batteryChemistry","fuelBlend","electricityMix","gwp100a_direct_[g]","gwp100a_directNonExhaust_[g]","gwp100a_energyChain_[g]","gwp100a_maintenance_[g]","gwp100a_vehicle_[g]","gwp100a_endOfLife_[g]","gwp100a_infrastructure_[g]","primaryEnergy_direct_[kWh]","primaryEnergy_directNonExhaust_[kWh]","primaryEnergy_energyChain_[kWh]","primaryEnergy_maintenance_[kWh]","primaryEnergy_vehicle_[kWh]","primaryEnergy_endOfLife_[kWh]","primaryEnergy_infrastructure_[kWh]","ubp21_direct_[UBP21]","ubp21_directNonExhaust_[UBP21]","ubp21_energyChain_[UBP21]","ubp21_maintenance_[UBP21]","ubp21_vehicle_[UBP21]","ubp21_endOfLife_[UBP21]","ubp21_infrastructure_[UBP21]","primaryEnergyNonRenewable_direct_[kWh]","primaryEnergyNonRenewable_directNonExhaust_[kWh]","primaryEnergyNonRenewable_energyChain_[kWh]","primaryEnergyNonRenewable_maintenance_[kWh]","primaryEnergyNonRenewable_vehicle_[kWh]","primaryEnergyNonRenewable_endOfLife_[kWh]","primaryEnergyNonRenewable_infrastructure_[kWh]","pm10_direct_[mg]","pm10_directNonExhaust_[mg]","pm10_energyChain_[mg]","pm10_maintenance_[mg]","pm10_vehicle_[mg]","pm10_endOfLife_[mg]","pm10_infrastructure_[mg]","pm25_direct_[mg]","pm25_directNonExhaust_[mg]","pm25_energyChain_[mg]","pm25_maintenance_[mg]","pm25_vehicle_[mg]","pm25_endOfLife_[mg]","pm25_infrastructure_[mg]","nmvoc_direct_[mg]","nmvoc_directNonExhaust_[mg]","nmvoc_energyChain_[mg]","nmvoc_maintenance_[mg]","nmvoc_vehicle_[mg]","nmvoc_endOfLife_[mg]","nmvoc_infrastructure_[mg]","nox_direct_[mg]","nox_directNonExhaust_[mg]","nox_energyChain_[mg]","nox_maintenance_[mg]","nox_vehicle_[mg]","nox_endOfLife_[mg]","nox_infrastructure_[mg]"]
["Auto 1","Passenger car","Passenger car","BEV",{"$nulls":4},"Compact","CH",null,2021,null,"bc8f7ada-7cc7-47ca-bfa1-6d387acdd391",1,"vkm",200000,12000,1.6,null,null,14.9,46.5,0,null,"NMC",null,"CONSUMER_PHYSICAL",{"v":0,"d":"0.00"},{"v":0,"d":"0.00"},{"v":21.9328,"d":"21.93"},5.58154298955043,49.6537365838476,5.71164756108943,17.6580135840186,{"v":0.149,"d":"0.15"},{"v":0,"d":"0.00"},0.296497221157274,{"v":0.0446508473349654,"d":"0.04"},0.220453757773292,{"v":0.00769373893864979,"d":"0.01"},0.234990829168376,{"v":0,"d":"0.00"},16.3352958342713,{"v":88.58795,"d":"88.59"},10.5013934205777,133.411282364497,7.38202495082712,61.1570734869099,{"v":0.149,"d":"0.15"},{"v":0,"d":"0.00"},0.195788266700308,{"v":0.0426085063354465,"d":"0.04"},0.199502529420972,{"v":0.00706481114677962,"d":"0.01"},0.199653590763005,{"v":0,"d":"0.00"},8.22098140107527,4.14889338632522,2.43975460893747,30.8203046233755,0.306441097177311,12.9617412180987,{"v":0,"d":"0.00"},7.92710052469467,5.40303979980154,1.45481192802225,28.2153730204582,0.467975177147257,4.0613591055105,{"v":0,"d":"0.00"},{"v":5.14682378869658e-11,"d":"5.15E-11"},61.1576614617277,4.89239604531011,72.2929953493568,0.638717280634601,53.8737004630815,{"v":0,"d":"0.00"},{"v":5.709243818635E-11,"d":"5.71E-11"},171.589385837751,9.2934754046839,133.772271074832,3.89992470065735,{"v":38.8507367310234,"d":"38.85"}]
["Auto 2","Passenger car","Passenger car","BEV",{"$nulls":4},"Medium","CH",null,2021,null,"f64694d8-7e95-4124-98d9-7e8e0529474a",1,"vkm",200000,12000,1.6,null,null,15.1,58.6,0,null,"NMC",null,"CONSUMER_PHYSICAL",{"v":0,"d":"0.00"},{"v":0,"d":"0.00"},{"v":22.2272,"d":"22.23"},6.66355830726537,{"v":59.5432333634171,"d":"59.54"},6.8420153383249,19.1709119809397,{"v":0.151,"d":"0.15"},{"v":0,"d":"0.00"},0.300477049629184,{"v":0.0533066797554688,"d":"0.05"},0.264214627807997,{"v":0.00955002891270755,"d":"0.01"},{"v":0.247084085544229,"d":"0.25"},{"v":0,"d":"0.00"},16.9728166487199,{"v":89.77705,"d":"89.78"},12.5371510165846,160.438111403933,8.90684910637346,64.8144642147325,{"v":0.151,"d":"0.15"},{"v":0,"d":"0.00"},0.198416297125816,0.0508684188016265,0.239105127843906,{"v":0.00876736204315521,"d":"0.01"},0.211515970435007,{"v":0,"d":"0.00"},9.31684038926388,4.20458323043697,2.91271555598709,37.3413637395574,{"v":0.380253611954722,"d":"0.38"},14.2530019401022,{"v":0,"d":"0.00"},8.95087326704827,5.47556382395995,1.73683587614225,{"v":34.5241339523787,"d":"34.52"},0.581037206370843,4.46295038949428,{"v":0,"d":"0.00"},{"v":5.82481487438491e-11,"d":"5.82E-11"},61.9785696692677,5.84081612758201,86.5198452529479,0.788073184793075,61.5593528041578,{"v":0,"d":"0.00"},{"v":6.51211258273488e-11,"d":"6.51E-11"},173.892599070473,11.0950709064118,163.020578015941,4.75684283788028,{"v":43.6638643801836,"d":"43.66"}]
["Auto 3","Passenger car","Passenger car","BEV",{"$nulls":4},"Large","CH",null,2021,null,"0c5ceda5-8251-49da-a005-50cba01fe861",1,"vkm",200000,12000,1.6,null,null,16.3,99.7,0,null,"NMC",null,"CONSUMER_PHYSICAL",{"v":0,"d":"0.00"},{"v":0,"d":"0.00"},{"v":23.9936,"d":"23.99"},8.63163200051651,90.212305029723,8.9319234093353,21.9227173267553,{"v":0.163,"d":"0.16"},{"v":0,"d":"0.00"},0.324356020460642,{"v":0.0690507416010619,"d":"0.07"},0.398907343165324,0.0151908992191803,0.269080465215935,{"v":0,"d":"0.00"},18.0874472006296,{"v":96.91165,"d":"96.91"},16.2399830421038,244.328234950077,12.1496790611746,{"v":71.4668787965978,"d":"71.47"},{"v":0.163,"d":"0.16"},{"v":0,"d":"0.00"},0.214184479678861,{"v":0.0658923432942821,"d":"0.07"},0.357798834145821,0.0139334668315585,0.233092409316784,{"v":0,"d":"0.00"},11.2320207884653,4.53872229510746,3.77298248805721,49.8947287590082,0.60874304930021,16.6016713318353,{"v":0,"d":"0.00"},10.7334179534294,5.91070796891041,2.24980820109413,51.819110892472,0.929320533824388,5.19340330315225,{"v":0,"d":"0.00"},{"v":7.0054510472137e-11,"d":"7.01E-11"},66.9040189145075,7.56589393702772,125.78312772767,1.22773223252365,75.5387576612812,{"v":0,"d":"0.00"},{"v":7.92653600781977e-11,"d":"7.93E-11"},187.711878466802,14.3719863574039,254.886593594548,6.95558043583677,52.4184446097653]
["Auto 4","Passenger car","Passenger car","BEV",{"$nulls":4},"SUV","CH",null,2021,null,"0c5ceda5-8251-49da-a005-50cba01fe861",1,"vkm",200000,12000,1.6,null,null,16.4,71.8,0,null,"NMC",null,"CONSUMER_PHYSICAL",{"v":0,"d":"0.00"},{"v":0,"d":"0.00"},{"v":24.1408,"d":"24.14"},7.70468685943767,78.0866239224707,7.88440024319422,20.6266415734715,{"v":0.164,"d":"0.16"},{"v":0,"d":"0.00"},0.326345934696597,{"v":0.0616354290146165,"d":"0.06"},0.344909151706019,0.011507532600923,0.25872036674608,{"v":0,"d":"0.00"},17.5688410025374,{"v":97.5062,"d":"97.51"},14.4959822122283,205.728084517154,10.3602351126268,68.3336509127804,{"v":0.164,"d":"0.16"},{"v":0,"d":"0.00"},{"v":0.215498494891615,"d":"0.22"},{"v":0.0588162089726059,"d":"0.06"},0.308851375705794,0.0105619300260215,{"v":0.222930099210292,"d":"0.22"},{"v":0,"d":"0.00"},10.3410812286612,4.56656721716333,{"v":3.36780444241406,"d":"3.37"},41.1867733464683,0.459742948802284,15.4954690142426,{"v":0,"d":"0.00"},9.90514200314154,{"v":5.94696998098962,"d":"5.95"},2.00820281520202,41.1605025134728,0.700984166977914,4.84936650136785,{"v":0,"d":"0.00"},{"v":6.45685531694608e-11,"d":"6.46E-11"},67.3144730182775,{"v":6.75339768806507,"d":"6.75"},109.510248874583,0.944860569204151,68.9545827638065,{"v":0,"d":"0.00"},{"v":7.26689544174109e-11,"d":"7.27E-11"},{"v":188.863485083163,"d":"188.86"},12.8285884320927,205.744844328444,5.61843890015213,48.2951154713172]
["Auto 5","Passenger car","Passenger car","ICEV-p",{"$nulls":4},"Compact","CH",null,2021,"EURO-6 d","bf07ba4d-b321-4a0f-aa13-abb6fb28d877",1,"vkm",200000,12000,1.6,null,5.4,{"$nulls":5},"GASOLINE_AVERAGE",null,123.968260917412,{"v":0,"d":"0.00"},{"v":33.74982693,"d":"33.75"},4.66183566314942,28.7690771047349,{"v":4.7338441036285,"d":"4.73"},15.816087848818,{"v":0.474902475,"d":"0.47"},{"v":0,"d":"0.00"},{"v":0.179000085,"d":"0.18"},{"v":0.0372934353252644,"d":"0.04"},0.129948721588827,{"v":0.00184905491134018,"d":"0.00"},0.221893553544903,134.411781911759,29.8785686832603,{"v":83.80077723,"d":"83.80"},8.77101017630167,65.3658742965689,5.24894448016355,56.3523115600015,{"v":0.4667895,"d":"0.47"},{"v":0,"d":"0.00"},{"v":0.172026508584,"d":"0.17"},{"v":0.0355876242035559,"d":"0.04"},0.11769128965649,{"v":0.00171919791919009,"d":"0.00"},0.187021908510975,{"v":0,"d":"0.00"},10.9862778053461,{"v":2.74356477,"d":"2.74"},2.03774029270604,16.6344844738444,{"v":0.0775437465405643,"d":"0.08"},11.7099967389659,0.926868213620077,9.48941205437474,{"v":9.67848264,"d":"9.68"},1.21509305615427,9.71773348989872,0.102113256140259,3.5112082702167,2.45087065784136,{"v":5.69973858298582e-11,"d":"5.70E-11"},{"v":115.62531867,"d":"115.63"},4.08624396604619,48.7481699534253,0.192616313945159,46.4148019007829,16.0395259413381,{"v":1.00124796423641E-10,"d":"1.00E-10"},{"v":117.32737788,"d":"117.33"},7.76212870836402,48.8119798945663,1.97348946231184,33.5491995238475]
["Auto 6","Passenger car","Passenger car","ICEV-p",{"$nulls":4},"Medium","CH",null,2021,"EURO-6 d","7503459a-8c38-4445-a247-08df1e94dfbc",1,"vkm",200000,12000,1.6,null,5.8,{"$nulls":5},"GASOLINE_AVERAGE",null,133.151095059442,{"v":0,"d":"0.00"},{"v":36.24981411,"d":"36.25"},5.43353206321057,33.485891173287,5.51993762075296,16.9790574836848,0.510080436111111,{"v":0,"d":"0.00"},0.192259350555555,{"v":0.0434667996104776,"d":"0.04"},0.151106023354739,{"v":0.00215270786090394,"d":"0.00"},0.231189676787811,144.368210201519,30.6179206951309,{"v":90.00824221,"d":"90.01"},10.2229182801105,75.8964784871251,6.1199245954573,59.1637590226712,{"v":0.5013665,"d":"0.50"},{"v":0,"d":"0.00"},0.184769212923555,{"v":0.0414786172520023,"d":"0.04"},0.136894695500213,{"v":0.00200144945367365,"d":"0.00"},0.196140556123977,{"v":0,"d":"0.00"},12.190660487014,{"v":2.94679179,"d":"2.95"},2.37505738446265,19.4082155101174,{"v":0.089250498742693,"d":"0.09"},12.7025928137864,{"v":0.995525118332676,"d":"1.00"},10.5262047863045,{"v":10.39540728,"d":"10.40"},1.41623333756438,11.3145588378502,0.118729932256056,3.81991272112415,2.63241663249628,{"v":6.34314689688618e-11,"d":"6.34E-11"},{"v":124.19015709,"d":"124.19"},4.76265986446486,56.665904628744,0.223935940031684,52.3227864125018,17.2276389740298,{"v":1.10935712672511E-10,"d":"1.11E-10"},{"v":126.01829476,"d":"126.02"},9.04703174096237,56.7858825026752,2.29824454158186,37.2490655003746]
["Auto 7","Passenger car","Passenger car","ICEV-p",{"$nulls":4},"Large","CH",null,2021,"EURO-6 d","75f459e8-4fbf-492c-a835-1949b2490afc",1,"vkm",200000,12000,1.6,null,8,{"$nulls":5},"GASOLINE_AVERAGE",null,183.65668284061,{"v":0,"d":"0.00"},{"v":49.9997436,"d":"50.00"},{"v":7.09509659518851,"d":"7.10"},43.8226050468117,7.22766906371799,19.218328559372,0.703559222222222,{"v":0,"d":"0.00"},0.265185311111111,{"v":0.0567588703503137,"d":"0.06"},0.197229132056324,{"v":0.00280182186418575,"d":"0.00"},0.249089146618983,199.128565795198,31.9707691536253,{"v":124.1492996,"d":"124.15"},13.3490686791391,99.1183825210234,8.00991638822714,64.5771359460436,{"v":0.69154,"d":"0.69"},{"v":0,"d":"0.00"},0.254854086791111,{"v":0.0541627053294531,"d":"0.05"},0.178696613691272,{"v":0.00260406767866593,"d":"0.00"},0.213698300743437,{"v":0,"d":"0.00"},14.3973795960072,{"v":4.0645404,"d":"4.06"},3.10134574818745,25.4979353909653,0.114329622204513,14.6138135486605,1.37313809425196,12.4252770042428,{"v":14.3384928,"d":"14.34"},1.84931499703126,14.8287646411492,0.153188984049354,{"v":4.41431598594554,"d":"4.41"},3.63091949309832,{"v":7.52424417876973e-11,"d":"7.52E-11"},{"v":171.2967684,"d":"171.30"},6.21907286002815,74.0652226743636,0.288546576041619,63.6984736497834,23.7622606538343,{"v":1.3072580990533E-10,"d":"1.31E-10"},{"v":173.8183376,"d":"173.82"},11.8135981080299,74.2883066840491,2.98861319097859,44.3730716796981]
["Auto 8","Passenger car","Passenger car","ICEV-p",{"$nulls":4},"SUV","CH",null,2021,"EURO-6 d","75f459e8-4fbf-492c-a835-1949b2490afc",1,"vkm",200000,12000,1.6,null,6.7,{"$nulls":5},"GASOLINE_AVERAGE",null,153.812471879011,{"v":0,"d":"0.00"},{"v":41.874785265,"d":"41.87"},7.09509659518851,43.8226050468117,7.22766906371799,19.218328559372,0.589230848611111,{"v":0,"d":"0.00"},0.222092698055555,{"v":0.0567588703503137,"d":"0.06"},0.197229132056324,{"v":0.00280182186418575,"d":"0.00"},0.249089146618983,166.770173853479,31.9707691536253,{"v":103.975038415,"d":"103.98"},13.3490686791391,99.1183825210234,8.00991638822714,64.5771359460436,{"v":0.57916475,"d":"0.58"},{"v":0,"d":"0.00"},0.213440297687555,{"v":0.0541627053294531,"d":"0.05"},0.178696613691272,{"v":0.00260406767866593,"d":"0.00"},0.213698300743437,{"v":0,"d":"0.00"},14.3973795960072,{"v":3.404052585,"d":"3.40"},3.10134574818745,25.4979353909653,0.114329622204513,14.6138135486605,1.15000315393602,12.4252770042428,{"v":12.00848772,"d":"12.01"},1.84931499703126,14.8287646411492,0.153188984049354,4.41431598594554,3.04089507546984,{"v":7.52424417876973e-11,"d":"7.52E-11"},{"v":143.461043535,"d":"143.46"},6.21907286002815,74.0652226743636,0.288546576041619,63.6984736497834,19.9008932975862,{"v":1.3072580990533E-10,"d":"1.31E-10"},{"v":145.57285774,"d":"145.57"},11.8135981080299,74.2883066840491,2.98861319097859,44.3730716796981]

{"sheet":"3a. Detailierte Ergebnisse","index":14,"n_rows":86,"n_cols":39,"rows_kept":86,"hidden":true,"merged":[[20,2,20,3],[20,4,20,6],[20,7,20,18],[20,19,20,20],[20,21,20,30],[20,31,20,34]]}
["Kosten"]
["NBW (CHF)","BEV","Verbrenner",null,"NBW (CHF/vkm)","BEV","Verbrenner"]
["Anschaffung",{"$f":"SUMPRODUCT('2b. Kosten'!Q5:Q14,'2b. Kosten'!C5:C14)","v":{"v":28810.890000000003,"d":"28,811"}},{"$f":"SUMPRODUCT('2b. Kosten'!AE5:AE14,'2b. Kosten'!C5:C14)","v":{"v":27219.464999999997,"d":"27,219"}},null,{"$f":"A3","v":"Anschaffung"},{"$f":"B3/SUMPRODUCT('2. Eingaben Fahrzeug-Ebene'!$C$5:$C$14,'2. Eingaben Fahrzeug-Ebene'!$Y$5:$Y$14)","v":{"v":0.27702778846153847,"d":"0.28"}},{"$f":"C3/SUMPRODUCT('2. Eingaben Fahrzeug-Ebene'!$C$5:$C$14,'2. Eingaben Fahrzeug-Ebene'!$Y$5:$Y$14)","v":{"v":0.26172562499999996,"d":"0.26"}}]
["Restwert",{"$f":"SUMPRODUCT('2b. Kosten'!R5:R14,'2b. Kosten'!C5:C14)","v":{"v":-7847.916781457712,"d":"-7,848"}},{"$f":"SUMPRODUCT('2b. Kosten'!AF5:AF14,'2b. Kosten'!C5:C14)","v":{"v":-7643.734002735171,"d":"-7,644"}},null,{"$f":"A4","v":"Restwert"},{"$f":"B4/SUMPRODUCT('2. Eingaben Fahrzeug-Ebene'!$C$5:$C$14,'2. Eingaben Fahrzeug-Ebene'!$Y$5:$Y$14)","v":{"v":-0.07546073828324723,"d":"-0.08"}},{"$f":"C4/SUMPRODUCT('2. Eingaben Fahrzeug-Ebene'!$C$5:$C$14,'2. Eingaben Fahrzeug-Ebene'!$Y$5:$Y$14)","v":{"v":-0.07349744233399202,"d":"-0.07"}}]
["Anschaffung (abzgl. Restwert)",{"$f":"SUMPRODUCT('2b. Kosten'!S5:S14,'2b. Kosten'!C5:C14)","v":{"v":20962.97321854229,"d":"20,963"}},{"$f":"SUMPRODUCT('2b. Kosten'!AG5:AG14,'2b. Kosten'!C5:C14)","v":{"v":19575.730997264825,"d":"19,576"}},null,"Anschaffung (abzgl. Restwert)",{"$f":"B5/SUMPRODUCT('2. Eingaben Fahrzeug-Ebene'!$C$5:$C$14,'2. Eingaben Fahrzeug-Ebene'!$Y$5:$Y$14)","v":{"v":0.20156705017829127,"d":"0.20"}},{"$f":"C5/SUMPRODUCT('2. Eingaben Fahrzeug-Ebene'!$C$5:$C$14,'2. Eingaben Fahrzeug-Ebene'!$Y$5:$Y$14)","v":{"v":0.18822818266600794,"d":"0.19"}}]
["Service und Reparatur",{"$f":"SUMPRODUCT('2b. Kosten'!T5:T14,'2b. Kosten'!C5:C14)","v":{"v":2416.1139618267403,"d":"2,416"}},{"$f":"SUMPRODUCT('2b. Kosten'!AH5:AH14,'2b. Kosten'!C5:C14)","v":{"v":4832.2279236534805,"d":"4,832"}},null,"Service und Reparatur",{"$f":"B6/SUMPRODUCT('2. Eingaben Fahrzeug-Ebene'!$C$5:$C$14,'2. Eingaben Fahrzeug-Ebene'!$Y$5:$Y$14)","v":{"v":0.02323186501756481,"d":"0.02"}},{"$f":"C6/SUMPRODUCT('2. Eingaben Fahrzeug-Ebene'!$C$5:$C$14,'2. Eingaben Fahrzeug-Ebene'!$Y$5:$Y$14)","v":{"v":0.04646373003512962,"d":"0.05"}}]
["Reifen",{"$f":"SUMPRODUCT('2b. Kosten'!U5:U14,'2b. Kosten'!C5:C14)","v":{"v":1747.0362493208738,"d":"1,747"}},{"$f":"SUMPRODUCT('2b. Kosten'!AI5:AI14,'2b. Kosten'!C5:C14)","v":{"v":1486.839361124148,"d":"1,487"}},null,"Reifen",{"$f":"B7/SUMPRODUCT('2. Eingaben Fahrzeug-Ebene'!$C$5:$C$14,'2. Eingaben Fahrzeug-Ebene'!$Y$5:$Y$14)","v":{"v":0.01679842547423917,"d":"0.02"}},{"$f":"C7/SUMPRODUCT('2. Eingaben Fahrzeug-Ebene'!$C$5:$C$14,'2. Eingaben Fahrzeug-Ebene'!$Y$5:$Y$14)","v":{"v":0.014296532318501422,"d":"0.01"}}]
["Energie",{"$f":"SUMPRODUCT('2b. Kosten'!V5:V14,'2b. Kosten'!C5:C14)","v":{"v":3891.554221182269,"d":"3,892"}},{"$f":"SUMPRODUCT('2b. Kosten'!AJ5:AJ14,'2b. Kosten'!C5:C14)","v":{"v":10089.691904588468,"d":"10,090"}},null,"Energie",{"$f":"B8/SUMPRODUCT('2. Eingaben Fahrzeug-Ebene'!$C$5:$C$14,'2. Eingaben Fahrzeug-Ebene'!$Y$5:$Y$14)","v":{"v":0.03741879058829105,"d":"0.04"}},{"$f":"C8/SUMPRODUCT('2. Eingaben Fahrzeug-Ebene'!$C$5:$C$14,'2. Eingaben Fahrzeug-Ebene'!$Y$5:$Y$14)","v":{"v":0.09701626831335065,"d":"0.10"}}]
["Ladeinfrastruktur",{"$f":"SUMPRODUCT('2b. Kosten'!W5:W14,'2b. Kosten'!C5:C14)","v":{"v":1720.6191365841023,"d":"1,721"}},{"$f":"SUMPRODUCT('2b. Kosten'!AK5:AK14,'2b. Kosten'!C5:C14)","v":0},null,"Ladeinfrastruktur",{"$f":"B9/SUMPRODUCT('2. Eingaben Fahrzeug-Ebene'!$C$5:$C$14,'2. Eingaben Fahrzeug-Ebene'!$Y$5:$Y$14)","v":{"v":0.016544414774847138,"d":"0.02"}},{"$f":"C9/SUMPRODUCT('2. Eingaben Fahrzeug-Ebene'!$C$5:$C$14,'2. Eingaben Fahrzeug-Ebene'!$Y$5:$Y$14)","v":{"v":0,"d":"0.00"}}]
["Versicherung",{"$f":"SUMPRODUCT('2b. Kosten'!X5:X14,'2b. Kosten'!C5:C14)","v":{"v":4460.5180833724435,"d":"4,461"}},{"$f":"SUMPRODUCT('2b. Kosten'!AL5:AL14,'2b. Kosten'!C5:C14)","v":{"v":4460.5180833724435,"d":"4,461"}},null,"Versicherung",{"$f":"B10/SUMPRODUCT('2. Eingaben Fahrzeug-Ebene'!$C$5:$C$14,'2. Eingaben Fahrzeug-Ebene'!$Y$5:$Y$14)","v":{"v":0.04288959695550426,"d":"0.04"}},{"$f":"C10/SUMPRODUCT('2. Eingaben Fahrzeug-Ebene'!$C$5:$C$14,'2. Eingaben Fahrzeug-Ebene'!$Y$5:$Y$14)","v":{"v":0.04288959695550426,"d":"0.04"}}]
["Flottenverwaltung",{"$f":"SUMPRODUCT('2b. Kosten'!Y5:Y14,'2b. Kosten'!C5:C14)","v":{"v":1486.839361124148,"d":"1,487"}},{"$f":"SUMPRODUCT('2b. Kosten'!AM5:AM14,'2b. Kosten'!C5:C14)","v":{"v":1486.839361124148,"d":"1,487"}},null,"Flottenverwaltung",{"$f":"B11/SUMPRODUCT('2. Eingaben Fahrzeug-Ebene'!$C$5:$C$14,'2. Eingaben Fahrzeug-Ebene'!$Y$5:$Y$14)","v":{"v":0.014296532318501422,"d":"0.01"}},{"$f":"C11/SUMPRODUCT('2. Eingaben Fahrzeug-Ebene'!$C$5:$C$14,'2. Eingaben Fahrzeug-Ebene'!$Y$5:$Y$14)","v":{"v":0.014296532318501422,"d":"0.01"}}]
[]
["NBW",{"$f":"SUM(B5:B11)","v":{"v":36685.65423195287,"d":"36,686"}},{"$f":"SUM(C5:C11)","v":{"v":41931.847631127515,"d":"41,932"}},null,"NBW",{"$f":"SUM(F5:F11)","v":{"v":0.35274667530723913,"d":"0.35"}},{"$f":"SUM(G5:G11)","v":{"v":0.40319084260699534,"d":"0.40"}}]
["Mehrkosten",{"$f":"B13-MIN(B13:C13)","v":0},{"$f":"C13-MIN(B13:C13)","v":{"v":5246.193399174648,"d":"5,246"}},null,"Mehrkosten",{"$f":"F13-MIN(F13:G13)","v":{"v":0,"d":"0.00"}},{"$f":"G13-MIN(F13:G13)","v":{"v":0.050444167299756204,"d":"0.05"}}]
["Mehrkosten",{"$f":"B14/MIN(B13:C13)","v":{"v":0,"d":"0.000"}},{"$f":"C14/MIN(B13:C13)","v":{"v":0.14300394824648546,"d":"0.143"}},null,"Mehrkosten",{"$f":"F14/MIN(F13:G13)","v":{"v":0,"d":"0.000"}},{"$f":"G14/MIN(F13:G13)","v":{"v":0.14300394824648538,"d":"0.143"}}]
[null,{"$f":"IF(B15>0,TEXT(B15,\"+0.0%; -0.0%; 0.0%\"),\"\")","v":""},{"$f":"IF(C15>0,TEXT(C15,\"+0.0%; -0.0%; 0.0%\"),\"\")","v":"+14.3%"},null,null,{"$f":"IF(F15>0,TEXT(F15,\"+0.0%; -0.0%; 0.0%\"),\"\")","v":""},{"$f":"IF(G15>0,TEXT(G15,\"+0.0%; -0.0%; 0.0%\"),\"\")","v":"+14.3%"}]
[]
[null,{"$f":"ROUND(B13,-2)","v":{"v":36700,"d":"36,700"}},{"$f":"ROUND(C13,-2)","v":{"v":41900,"d":"41,900"}}]
[]
["Ladeinfrastruktur"]
["Ladepunkte","Wohnort (AC)","Firmenstandort (über Nacht)",null,"Firmenstandort (tagsüber)",null,null,"Firmenstandort (tagsüber)",{"$nulls":11},"Firmenstandort (AC)",null,"Firmenstandort (DC)",{"$nulls":9},"Firmenstandort",{"$nulls":3},"Wohnort","Firmenstandort (über Nacht)","Firmenstandort (tagsüber)","öffentlich"]
["Leistung (kW)",{"$f":"'Eingaben (Inputs)'!$J$24","v":11},{"$f":"TRANSPOSE(INDEX(Ladeleistung,_xlfn.SEQUENCE(2)))","v":11},22,"≤ 100","≤ 150","> 150",{"$f":"TRANSPOSE(Ladeleistung)","v":11},22,50,66,75,100,120,150,180,200,225,250,{"$f":"TRANSPOSE(Ladeleistung)","v":11},22,50,66,75,100,120,150,180,200,225,250,"≤ 22","22-80","80-150","> 150"]
["Anzahl (unrounded)",{"$f":"SUMPRODUCT('2a. Ladekonzept'!V5:V14,'2a. Ladekonzept'!C5:C14)","v":0},{"$f":"SUM(('2a. Ladekonzept'!$Z$5:$Z$14=C22)*('2a. Ladekonzept'!$X$5:$X$14)*('2a. Ladekonzept'!$C$5:$C$14))","v":1},{"$f":"SUM(('2a. Ladekonzept'!$Z$5:$Z$14=D22)*('2a. Ladekonzept'!$X$5:$X$14)*('2a. Ladekonzept'!$C$5:$C$14))","v":0},{"$f":"SUM(H23:M23)","v":0},{"$f":"SUM(N23:O23)","v":0},{"$f":"SUM(P23:S23)","v":0},{"$f":"SUM(('2a. Ladekonzept'!$AF$5:$AF$14=H22)*('2a. Ladekonzept'!$AD$5:$AD$14)*('2a. Ladekonzept'!$C$5:$C$14))","v":0},{"$f":"SUM(('2a. Ladekonzept'!$AF$5:$AF$14=I22)*('2a. Ladekonzept'!$AD$5:$AD$14)*('2a. Ladekonzept'!$C$5:$C$14))","v":0},{"$f":"SUM(('2a. Ladekonzept'!$AF$5:$AF$14=J22)*('2a. Ladekonzept'!$AD$5:$AD$14)*('2a. Ladekonzept'!$C$5:$C$14))","v":0},{"$f":"SUM(('2a. Ladekonzept'!$AF$5:$AF$14=K22)*('2a. Ladekonzept'!$AD$5:$AD$14)*('2a. Ladekonzept'!$C$5:$C$14))","v":0},{"$f":"SUM(('2a. Ladekonzept'!$AF$5:$AF$14=L22)*('2a. Ladekonzept'!$AD$5:$AD$14)*('2a. Ladekonzept'!$C$5:$C$14))","v":0},{"$f":"SUM(('2a. Ladekonzept'!$AF$5:$AF$14=M22)*('2a. Ladekonzept'!$AD$5:$AD$14)*('2a. Ladekonzept'!$C$5:$C$14))","v":0},{"$f":"SUM(('2a. Ladekonzept'!$AF$5:$AF$14=N22)*('2a. Ladekonzept'!$AD$5:$AD$14)*('2a. Ladekonzept'!$C$5:$C$14))","v":0},{"$f":"SUM(('2a. Ladekonzept'!$AF$5:$AF$14=O22)*('2a. Ladekonzept'!$AD$5:$AD$14)*('2a. Ladekonzept'!$C$5:$C$14))","v":0},{"$f":"SUM(('2a. Ladekonzept'!$AF$5:$AF$14=P22)*('2a. Ladekonzept'!$AD$5:$AD$14)*('2a. Ladekonzept'!$C$5:$C$14))","v":0},{"$f":"SUM(('2a. Ladekonzept'!$AF$5:$AF$14=Q22)*('2a. Ladekonzept'!$AD$5:$AD$14)*('2a. Ladekonzept'!$C$5:$C$14))","v":0},{"$f":"SUM(('2a. Ladekonzept'!$AF$5:$AF$14=R22)*('2a. Ladekonzept'!$AD$5:$AD$14)*('2a. Ladekonzept'!$C$5:$C$14))","v":0},{"$f":"SUM(('2a. Ladekonzept'!$AF$5:$AF$14=S22)*('2a. Ladekonzept'!$AD$5:$AD$14)*('2a. Ladekonzept'!$C$5:$C$14))","v":0},{"$f":"MAX(C23-MAX(I23-D23,0),H23-MAX(D23-I23,0))","v":1},{"$f":"MAX(D23,I23)","v":0},{"$f":"J23","v":0},{"$f":"K23","v":0},0,0,0,0,0,0,0,0]
["Anzahl (rounded)",{"$f":"ROUNDUP(B23,0)","v":0},{"$f":"ROUNDUP(C23,0)","v":1},0,{"$f":"ROUNDUP(E23,0)","v":0},{"$f":"ROUNDUP(F23,0)","v":0},{"$f":"ROUNDUP(G23,0)","v":0},{"$f":"ROUNDUP(H23,0)","v":0},0,0,0,0,0,0,0,0,0,0,0,{"$f":"ROUNDUP(T23,0)","v":1},{"$f":"ROUNDUP(U23,0)","v":0},{"$f":"ROUNDUP(J23,0)","v":0},0,0,0,0,0,0,0,0,0,{"$f":"SUM(T24:U24)","v":1},{"$f":"SUM(V24:X24)","v":0},{"$f":"SUM(Y24:AA24)","v":0},{"$f":"SUM(AB24:AE24)","v":0}]
["kWh pro Tag",{"$f":"SUM(('2a. Ladekonzept'!$S$5:$S$14)*('2a. Ladekonzept'!$C$5:$C$14))/'2d. Annahmen'!$B$56","v":0},{"$f":"SUM(('2a. Ladekonzept'!$Z$5:$Z$14=C22)*('2a. Ladekonzept'!$T$5:$T$14)*('2a. Ladekonzept'!$C$5:$C$14))/'2d. Annahmen'!$B$56","v":{"v":16.77777777777778,"d":"17"}},{"$f":"SUM(('2a. Ladekonzept'!$Z$5:$Z$14=D22)*('2a. Ladekonzept'!$T$5:$T$14)*('2a. Ladekonzept'!$C$5:$C$14))","v":0},{"$f":"SUM(H25:M25)","v":0},{"$f":"SUM(N25:O25)","v":0},{"$f":"SUM(P25:S25)","v":0},{"$f":"SUM(('2a. Ladekonzept'!$AF$5:$AF$14=H22)*('2a. Ladekonzept'!$U$5:$U$14)*('2a. Ladekonzept'!$C$5:$C$14))/'2d. Annahmen'!$B$56","v":0},{"$f":"SUM(('2a. Ladekonzept'!$AF$5:$AF$14=I22)*('2a. Ladekonzept'!$U$5:$U$14)*('2a. Ladekonzept'!$C$5:$C$14))/'2d. Annahmen'!$B$56","v":0},{"$f":"SUM(('2a. Ladekonzept'!$AF$5:$AF$14=J22)*('2a. Ladekonzept'!$U$5:$U$14)*('2a. Ladekonzept'!$C$5:$C$14))/'2d. Annahmen'!$B$56","v":0},{"$f":"SUM(('2a. Ladekonzept'!$AF$5:$AF$14=K22)*('2a. Ladekonzept'!$U$5:$U$14)*('2a. Ladekonzept'!$C$5:$C$14))/'2d. Annahmen'!$B$56","v":0},{"$f":"SUM(('2a. Ladekonzept'!$AF$5:$AF$14=L22)*('2a. Ladekonzept'!$U$5:$U$14)*('2a. Ladekonzept'!$C$5:$C$14))/'2d. Annahmen'!$B$56","v":0},{"$f":"SUM(('2a. Ladekonzept'!$AF$5:$AF$14=M22)*('2a. Ladekonzept'!$U$5:$U$14)*('2a. Ladekonzept'!$C$5:$C$14))/'2d. Annahmen'!$B$56","v":0},{"$f":"SUM(('2a. Ladekonzept'!$AF$5:$AF$14=N22)*('2a. Ladekonzept'!$U$5:$U$14)*('2a. Ladekonzept'!$C$5:$C$14))/'2d. Annahmen'!$B$56","v":0},{"$f":"SUM(('2a. Ladekonzept'!$AF$5:$AF$14=O22)*('2a. Ladekonzept'!$U$5:$U$14)*('2a. Ladekonzept'!$C$5:$C$14))/'2d. Annahmen'!$B$56","v":0},{"$f":"SUM(('2a. Ladekonzept'!$AF$5:$AF$14=P22)*('2a. Ladekonzept'!$U$5:$U$14)*('2a. Ladekonzept'!$C$5:$C$14))/'2d. Annahmen'!$B$56","v":0},{"$f":"SUM(('2a. Ladekonzept'!$AF$5:$AF$14=Q22)*('2a. Ladekonzept'!$U$5:$U$14)*('2a. Ladekonzept'!$C$5:$C$14))/'2d. Annahmen'!$B$56","v":0},{"$f":"SUM(('2a. Ladekonzept'!$AF$5:$AF$14=R22)*('2a. Ladekonzept'!$U$5:$U$14)*('2a. Ladekonzept'!$C$5:$C$14))/'2d. Annahmen'!$B$56","v":0},{"$f":"SUM(('2a. Ladekonzept'!$AF$5:$AF$14=S22)*('2a. Ladekonzept'!$U$5:$U$14)*('2a. Ladekonzept'!$C$5:$C$14))/'2d. Annahmen'!$B$56","v":0},{"$f":"C25+H25","v":{"v":16.77777777777778,"d":"17"}},{"$f":"D25+I25","v":0},{"$f":"J25","v":0},{"$f":"K25","v":0},0,0,0,0,0,0,0,0,{"$f":"SUM(T25:U25)","v":{"v":16.77777777777778,"d":"17"}},{"$f":"SUM(V25:X25)","v":0},{"$f":"SUM(Y25:AA25)","v":0},{"$f":"SUM(AB25:AE25)","v":0},{"$f":"SUMPRODUCT('2a. Ladekonzept'!$S$5:$S$14,'2c. LCA'!$C$5:$C$14)/'2d. Annahmen'!$B$56","v":0},{"$f":"SUMPRODUCT('2a. Ladekonzept'!$T$5:$T$14,'2c. LCA'!$C$5:$C$14)/'2d. Annahmen'!$B$56","v":{"v":16.77777777777778,"d":"17"}},{"$f":"SUMPRODUCT('2a. Ladekonzept'!$U$5:$U$14,'2c. LCA'!$C$5:$C$14)/'2d. Annahmen'!$B$56","v":0},{"$f":"SUMPRODUCT('2a. Ladekonzept'!$Q$5:$Q$14,'2c. LCA'!$C$5:$C$14)/'2d. Annahmen'!$B$56","v":0}]
["kWh pro Jahr",{"$f":"SUM(('2a. Ladekonzept'!$S$5:$S$14)*('2. Eingaben Fahrzeug-Ebene'!$W$5:$W$14)*('2a. Ladekonzept'!$C$5:$C$14))/'2d. Annahmen'!$B$56","v":0},{"$f":"SUM(('2a. Ladekonzept'!$Z$5:$Z$14=C22)*('2a. Ladekonzept'!$T$5:$T$14)*('2. Eingaben Fahrzeug-Ebene'!$W$5:$W$14)*('2a. Ladekonzept'!$C$5:$C$14))/'2d. Annahmen'!$B$56","v":{"v":4362.222222222222,"d":"4,362"}},{"$f":"SUM(('2a. Ladekonzept'!$Z$5:$Z$14=D22)*('2a. Ladekonzept'!$T$5:$T$14)*('2. Eingaben Fahrzeug-Ebene'!$W$5:$W$14)*('2a. Ladekonzept'!$C$5:$C$14))/'2d. Annahmen'!$B$56","v":0},0,{"$f":"SUM(N26:O26)","v":0},{"$f":"SUM(P26:S26)","v":0},{"$f":"SUM(('2a. Ladekonzept'!$AF$5:$AF$14=H22)*('2a. Ladekonzept'!$U$5:$U$14)*('2. Eingaben Fahrzeug-Ebene'!$W$5:$W$14)*('2a. Ladekonzept'!$C$5:$C$14))/'2d. Annahmen'!$B$56","v":0},{"$f":"SUM(('2a. Ladekonzept'!$AF$5:$AF$14=I22)*('2a. Ladekonzept'!$U$5:$U$14)*('2. Eingaben Fahrzeug-Ebene'!$W$5:$W$14)*('2a. Ladekonzept'!$C$5:$C$14))/'2d. Annahmen'!$B$56","v":0},{"$f":"SUM(('2a. Ladekonzept'!$AF$5:$AF$14=J22)*('2a. Ladekonzept'!$U$5:$U$14)*('2. Eingaben Fahrzeug-Ebene'!$W$5:$W$14)*('2a. Ladekonzept'!$C$5:$C$14))/'2d. Annahmen'!$B$56","v":0},{"$f":"SUM(('2a. Ladekonzept'!$AF$5:$AF$14=K22)*('2a. Ladekonzept'!$U$5:$U$14)*('2. Eingaben Fahrzeug-Ebene'!$W$5:$W$14)*('2a. Ladekonzept'!$C$5:$C$14))/'2d. Annahmen'!$B$56","v":0},{"$f":"SUM(('2a. Ladekonzept'!$AF$5:$AF$14=L22)*('2a. Ladekonzept'!$U$5:$U$14)*('2. Eingaben Fahrzeug-Ebene'!$W$5:$W$14)*('2a. Ladekonzept'!$C$5:$C$14))/'2d. Annahmen'!$B$56","v":0},{"$f":"SUM(('2a. Ladekonzept'!$AF$5:$AF$14=M22)*('2a. Ladekonzept'!$U$5:$U$14)*('2. Eingaben Fahrzeug-Ebene'!$W$5:$W$14)*('2a. Ladekonzept'!$C$5:$C$14))/'2d. Annahmen'!$B$56","v":0},{"$f":"SUM(('2a. Ladekonzept'!$AF$5:$AF$14=N22)*('2a. Ladekonzept'!$U$5:$U$14)*('2. Eingaben Fahrzeug-Ebene'!$W$5:$W$14)*('2a. Ladekonzept'!$C$5:$C$14))/'2d. Annahmen'!$B$56","v":0},{"$f":"SUM(('2a. Ladekonzept'!$AF$5:$AF$14=O22)*('2a. Ladekonzept'!$U$5:$U$14)*('2. Eingaben Fahrzeug-Ebene'!$W$5:$W$14)*('2a. Ladekonzept'!$C$5:$C$14))/'2d. Annahmen'!$B$56","v":0},{"$f":"SUM(('2a. Ladekonzept'!$AF$5:$AF$14=P22)*('2a. Ladekonzept'!$U$5:$U$14)*('2. Eingaben Fahrzeug-Ebene'!$W$5:$W$14)*('2a. Ladekonzept'!$C$5:$C$14))/'2d. Annahmen'!$B$56","v":0},{"$f":"SUM(('2a. Ladekonzept'!$AF$5:$AF$14=Q22)*('2a. Ladekonzept'!$U$5:$U$14)*('2. Eingaben Fahrzeug-Ebene'!$W$5:$W$14)*('2a. Ladekonzept'!$C$5:$C$14))/'2d. Annahmen'!$B$56","v":0},{"$f":"SUM(('2a. Ladekonzept'!$AF$5:$AF$14=R22)*('2a. Ladekonzept'!$U$5:$U$14)*('2. Eingaben Fahrzeug-Ebene'!$W$5:$W$14)*('2a. Ladekonzept'!$C$5:$C$14))/'2d. Annahmen'!$B$56","v":0},{"$f":"SUM(('2a. Ladekonzept'!$AF$5:$AF$14=S22)*('2a. Ladekonzept'!$U$5:$U$14)*('2. Eingaben Fahrzeug-Ebene'!$W$5:$W$14)*('2a. Ladekonzept'!$C$5:$C$14))/'2d. Annahmen'!$B$56","v":0},{"$f":"C26+H26","v":{"v":4362.222222222222,"d":"4,362"}},{"$f":"D26+I26","v":0},{"$f":"J26","v":0},{"$f":"K26","v":0},0,0,0,0,0,0,0,0,{"$f":"SUM(T26:U26)","v":{"v":4362.222222222222,"d":"4,362"}},{"$f":"SUM(V26:X26)","v":0},{"$f":"SUM(Y26:AA26)","v":0},{"$f":"SUM(AB26:AE26)","v":0},{"$f":"SUMPRODUCT('2a. Ladekonzept'!$S$5:$S$14,'2. Eingaben Fahrzeug-Ebene'!$W$5:$W$14,'2c. LCA'!$C$5:$C$14)/'2d. Annahmen'!$B$56","v":0},{"$f":"SUMPRODUCT('2a. Ladekonzept'!$T$5:$T$14,'2. Eingaben Fahrzeug-Ebene'!$W$5:$W$14,'2c. LCA'!$C$5:$C$14)/'2d. Annahmen'!$B$56","v":{"v":4362.222222222222,"d":"4,362"}},{"$f":"SUMPRODUCT('2a. Ladekonzept'!$U$5:$U$14,'2. Eingaben Fahrzeug-Ebene'!$W$5:$W$14,'2c. LCA'!$C$5:$C$14)/'2d. Annahmen'!$B$56","v":0},{"$f":"SUMPRODUCT('2a. Ladekonzept'!$Q$5:$Q$14,'2. Eingaben Fahrzeug-Ebene'!$W$5:$W$14,'2c. LCA'!$C$5:$C$14)/'2d. Annahmen'!$B$56","v":0}]
["Investitionskosten (CHF)",{"$f":"B24*INDEX('2d. Annahmen'!$B$38:$B$50,MATCH('1b. Corrected Inputs Segment'!$J$24,Ladeleistung,0))","v":0},{"$nulls":17},{"$f":"T24:AE24*TRANSPOSE('2d. Annahmen'!B38:B49)","v":{"v":1632,"d":"1,632"}},0,0,0,0,0,0,0,0,0,0,0]
["Investitionskosten (CHF/LP)",{"$f":"IF(B24>0,B27/SUMPRODUCT('2a. Ladekonzept'!V5:V14,'2a. Ladekonzept'!C5:C14),0)","v":0},{"$nulls":17},{"$f":"IF(T23>0,T27/T23,0)","v":1632},{"$f":"IF(U23>0,U27/U23,0)","v":0},0,0,0,0,0,0,0,0,0,0]
[]
["Energiebedarf","Wohnort","Firmenstandort (über Nacht)","Firmenstandort (tagsüber)","öffentlich","Total","Wohnort","Firmenstandort (AC)","Firmenstandort (DC)","öffentlich","Total"]
["kWh pro Tag",{"$f":"B25","v":0},{"$f":"SUM(C25:D25)","v":{"v":16.77777777777778,"d":"17"}},{"$f":"SUM(H25:S25)","v":0},{"$f":"AM25","v":0},{"$f":"SUM(B31:E31)","v":{"v":16.77777777777778,"d":"17"}},{"$f":"B31","v":0},{"$f":"SUM(T25:U25)","v":{"v":16.77777777777778,"d":"17"}},{"$f":"SUM(V25:AE25)","v":0},{"$f":"E31","v":0},{"$f":"SUM(G31:J31)","v":{"v":16.77777777777778,"d":"17"}}]
["kWh pro Jahr",{"$f":"B26","v":0},{"$f":"SUM(C26:D26)","v":{"v":4362.222222222222,"d":"4362"}},{"$f":"SUM(H26:S26)","v":0},{"$f":"AM26","v":0},{"$f":"SUM(B32:E32)","v":{"v":4362.222222222222,"d":"4362"}},{"$f":"B32","v":0},{"$f":"SUM(T26:U26)","v":{"v":4362.222222222222,"d":"4362"}},{"$f":"SUM(V26:AE26)","v":0},{"$f":"E32","v":0},{"$f":"SUM(G32:J32)","v":{"v":4362.222222222222,"d":"4362"}}]
["Anteil",{"$f":"B32/$F$32","v":{"v":0,"d":"0%"}},{"$f":"C32/$F$32","v":{"v":1,"d":"100%"}},{"$f":"D32/$F$32","v":{"v":0,"d":"0%"}},{"v":0,"d":"0%"},{"v":1,"d":"100%"},{"$f":"G32/$K$32","v":{"v":0,"d":"0%"}},{"$f":"H32/$K$32","v":{"v":1,"d":"100%"}},{"v":0,"d":"0%"},{"v":0,"d":"0%"},{"v":1,"d":"100%"}]
["kWh pro Jahr (Grafik)",{"$nulls":5},{"$f":"IF(G32=0,NA(),G32)","v":{"$error":"#N/A"}},{"$f":"IF(H32=0,NA(),H32)","v":{"v":4362.222222222222,"d":"4362"}},{"$f":"IF(I32=0,NA(),I32)","v":{"$error":"#N/A"}},{"$error":"#N/A"}]
[]
["Anschlussleistung (pro Standort)","Wohnort","Firmenstandort",null,"Basisinfrastruktur (pro Standort)","Wohnort","Firmenstandort, < 50 kW","Firmenstandort, 50 - 150 kW","Firmenstandort, > 150 kW","Firmenstandort, alle"]
["Total (kW)",{"$f":"B22*B24","v":0},{"$f":"MAX(SUMPRODUCT('2a. Ladekonzept'!AB5:AB14,'2b. Kosten'!C5:C14),SUMPRODUCT('2a. Ladekonzept'!AI5:AI14,'2b. Kosten'!C5:C14))","v":{"v":8.8,"d":"9"}},null,"Total (LP)",{"$f":"B24","v":0},{"$f":"SUM(T24:U24)","v":1},{"$f":"SUM(V24:AA24)","v":0},{"$f":"SUM(AB24:AE24)","v":0},{"$f":"SUM(G37:I37)","v":1}]
["Erhöhung (kW)",0,{"$f":"MAX(C37-'Eingaben (Inputs)'!$J$27,0)","v":0},null,"Investitionskosten (CHF)",{"$f":"IF(F37>0,'2d. Annahmen'!$F$65+'2d. Annahmen'!$F$66*F37,0)","v":0},{"$f":"IF(G37>0,'2d. Annahmen'!B$65+'2d. Annahmen'!B$66*G37,0)","v":3000},{"$f":"IF(H37>0,'2d. Annahmen'!C$65+'2d. Annahmen'!C$66*H37,0)","v":0},{"$f":"IF(I37>0,'2d. Annahmen'!D$65+'2d. Annahmen'!D$66*I37,0)","v":0},{"$f":"SUM(G38:I38)","v":3000}]
["Investitionskosten (CHF)",0,{"$f":"IF(C38>0,'2d. Annahmen'!$B$61*C38+'2d. Annahmen'!$B$60,0)","v":0},null,"Investitionskosten (CHF/LP)",{"$f":"IF(F37>0,F38/SUM(B23),0)","v":0},{"$f":"IF(G37>0,G38/SUM(H23:I23,C23:D23),0)","v":3000},{"$f":"IF(H37>0,H38/SUM(J23:O23),0)","v":0},{"$f":"IF(I37>0,I38/SUM(P23:S23),0)","v":0},{"$f":"IF(J37>0,J38/SUM(H23:S23,C23:D23),0)","v":3000}]
["Stromtarif (effektiv)",{"$f":"'Eingaben (Inputs)'!J19","v":0.24},{"$f":"SUMPRODUCT('2b. Kosten'!AY5:AY14,'2b. Kosten'!C5:C14)/SUMPRODUCT('2b. Kosten'!D5:D14,'2b. Kosten'!C5:C14)+'Eingaben (Inputs)'!$J$20","v":0.24}]
["Investitionskosten (CHF/kW total)",{"$f":"IFERROR(B39/B37,0)","v":0},{"$f":"IFERROR(C39/C37,0)","v":0}]
[]
[]
["LCA"]
["GWP100 (kg CO2-eq)","BEV","Verbrenner",null,"GWP100 (g CO2-eq / vkm)","BEV","Verbrenner"]
["Direkt",{"$f":"SUMPRODUCT('2c. LCA'!N5:N14,'2. Eingaben Fahrzeug-Ebene'!$Y5:$Y14,'2c. LCA'!$C$5:$C$14)/1000","v":0},{"$f":"SUMPRODUCT('2c. LCA'!V5:V14,'2. Eingaben Fahrzeug-Ebene'!$Y5:$Y14,'2c. LCA'!$C$5:$C$14)/1000","v":{"v":13847.71388618197,"d":"13,848"}},null,"Direkt",{"$f":"B46/SUMPRODUCT('2. Eingaben Fahrzeug-Ebene'!$Y$5:$Y$14,'2. Eingaben Fahrzeug-Ebene'!$C$5:$C$14)*1000","v":0},{"$f":"C46/SUMPRODUCT('2. Eingaben Fahrzeug-Ebene'!$Y$5:$Y$14,'2. Eingaben Fahrzeug-Ebene'!$C$5:$C$14)*1000","v":{"v":133.151095059442,"d":"133"}}]
["Energie-bereitstellung",{"$f":"SUMPRODUCT('2c. LCA'!P5:P14,'2. Eingaben Fahrzeug-Ebene'!$Y5:$Y14,'2c. LCA'!$C$5:$C$14)/1000","v":{"v":2311.6288,"d":"2,312"}},{"$f":"SUMPRODUCT('2c. LCA'!X5:X14,'2. Eingaben Fahrzeug-Ebene'!$Y5:$Y14,'2c. LCA'!$C$5:$C$14)/1000","v":{"v":3769.9806674400006,"d":"3,770"}},null,"Energie-bereitstellung",{"$f":"B47/SUMPRODUCT('2. Eingaben Fahrzeug-Ebene'!$Y$5:$Y$14,'2. Eingaben Fahrzeug-Ebene'!$C$5:$C$14)*1000","v":{"v":22.2272,"d":"22"}},{"$f":"C47/SUMPRODUCT('2. Eingaben Fahrzeug-Ebene'!$Y$5:$Y$14,'2. Eingaben Fahrzeug-Ebene'!$C$5:$C$14)*1000","v":{"v":36.24981411000001,"d":"36"}}]
["Wartung",{"$f":"SUMPRODUCT('2c. LCA'!Q5:Q14,'2. Eingaben Fahrzeug-Ebene'!$Y5:$Y14,'2c. LCA'!$C$5:$C$14)/1000","v":{"v":693.0100639555984,"d":"693"}},{"$f":"SUMPRODUCT('2c. LCA'!Y5:Y14,'2. Eingaben Fahrzeug-Ebene'!$Y5:$Y14,'2c. LCA'!$C$5:$C$14)/1000","v":{"v":565.0873345738993,"d":"565"}},null,"Wartung",{"$f":"B48/SUMPRODUCT('2. Eingaben Fahrzeug-Ebene'!$Y$5:$Y$14,'2. Eingaben Fahrzeug-Ebene'!$C$5:$C$14)*1000","v":{"v":6.66355830726537,"d":"7"}},{"$f":"C48/SUMPRODUCT('2. Eingaben Fahrzeug-Ebene'!$Y$5:$Y$14,'2. Eingaben Fahrzeug-Ebene'!$C$5:$C$14)*1000","v":{"v":5.43353206321057,"d":"5"}}]
["Fahrzeug",{"$f":"SUMPRODUCT('2c. LCA'!R5:R14,'2. Eingaben Fahrzeug-Ebene'!$Y5:$Y14,'2c. LCA'!$C$5:$C$14)/1000","v":{"v":6192.496269795379,"d":"6,192"}},{"$f":"SUMPRODUCT('2c. LCA'!Z5:Z14,'2. Eingaben Fahrzeug-Ebene'!$Y5:$Y14,'2c. LCA'!$C$5:$C$14)/1000","v":{"v":3482.532682021848,"d":"3,483"}},null,"Fahrzeug",{"$f":"B49/SUMPRODUCT('2. Eingaben Fahrzeug-Ebene'!$Y$5:$Y$14,'2. Eingaben Fahrzeug-Ebene'!$C$5:$C$14)*1000","v":{"v":59.5432333634171,"d":"60"}},{"$f":"C49/SUMPRODUCT('2. Eingaben Fahrzeug-Ebene'!$Y$5:$Y$14,'2. Eingaben Fahrzeug-Ebene'!$C$5:$C$14)*1000","v":{"v":33.485891173287,"d":"33"}}]
["Fahrzeug-entsorgung",{"$f":"SUMPRODUCT('2c. LCA'!S5:S14,'2. Eingaben Fahrzeug-Ebene'!$Y5:$Y14,'2c. LCA'!$C$5:$C$14)/1000","v":{"v":711.5695951857895,"d":"712"}},{"$f":"SUMPRODUCT('2c. LCA'!AA5:AA14,'2. Eingaben Fahrzeug-Ebene'!$Y5:$Y14,'2c. LCA'!$C$5:$C$14)/1000","v":{"v":574.0735125583078,"d":"574"}},null,"Fahrzeug-entsorgung",{"$f":"B50/SUMPRODUCT('2. Eingaben Fahrzeug-Ebene'!$Y$5:$Y$14,'2. Eingaben Fahrzeug-Ebene'!$C$5:$C$14)*1000","v":{"v":6.842015338324899,"d":"7"}},{"$f":"C50/SUMPRODUCT('2. Eingaben Fahrzeug-Ebene'!$Y$5:$Y$14,'2. Eingaben Fahrzeug-Ebene'!$C$5:$C$14)*1000","v":{"v":5.51993762075296,"d":"6"}}]
["Infrastruktur",{"$f":"SUMPRODUCT('2c. LCA'!T5:T14,'2. Eingaben Fahrzeug-Ebene'!$Y5:$Y14,'2c. LCA'!$C$5:$C$14)/1000","v":{"v":1993.7748460177288,"d":"1,994"}},{"$f":"SUMPRODUCT('2c. LCA'!AB5:AB14,'2. Eingaben Fahrzeug-Ebene'!$Y5:$Y14,'2c. LCA'!$C$5:$C$14)/1000","v":{"v":1765.8219783032193,"d":"1,766"}},null,"Infrastruktur",{"$f":"B51/SUMPRODUCT('2. Eingaben Fahrzeug-Ebene'!$Y$5:$Y$14,'2. Eingaben Fahrzeug-Ebene'!$C$5:$C$14)*1000","v":{"v":19.1709119809397,"d":"19"}},{"$f":"C51/SUMPRODUCT('2. Eingaben Fahrzeug-Ebene'!$Y$5:$Y$14,'2. Eingaben Fahrzeug-Ebene'!$C$5:$C$14)*1000","v":{"v":16.9790574836848,"d":"17"}}]
["Total",{"$f":"SUM(B46:B51)","v":{"v":11902.479574954494,"d":"11,902"}},{"$f":"SUM(C46:C51)","v":{"v":24005.210061079244,"d":"24,005"}},null,"Total",{"$f":"SUM(F46:F51)","v":{"v":114.44691898994708,"d":"114"}},{"$f":"SUM(G46:G51)","v":{"v":230.81932751037738,"d":"231"}}]
[null,{"$f":"B52-MIN(B52:C52)","v":0},{"$f":"C52-MIN(B52:C52)","v":{"v":12102.73048612475,"d":"12,103"}},null,null,{"$f":"F52-MIN(F52:G52)","v":0},{"$f":"G52-MIN(F52:G52)","v":{"v":116.3724085204303,"d":"116"}}]
[null,{"$f":"B53/MIN(B52:C52)","v":{"v":0,"d":"0.000"}},{"$f":"C53/MIN(B52:C52)","v":{"v":1.0168243020212049,"d":"1.017"}},null,null,{"$f":"F53/MIN(F52:G52)","v":{"v":0,"d":"0.000"}},{"$f":"G53/MIN(F52:G52)","v":{"v":1.0168243020212047,"d":"1.017"}}]
[null,{"$f":"IF(B54>0,TEXT(B54,\"+0.0%; -0.0%; 0.0%\"),\"\")","v":""},{"$f":"IF(C54>0,TEXT(C54,\"+0.0%; -0.0%; 0.0%\"),\"\")","v":"+101.7%"},null,null,{"$f":"IF(F54>0,TEXT(F54,\"+0.0%; -0.0%; 0.0%\"),\"\")","v":""},{"$f":"IF(G54>0,TEXT(G54,\"+0.0%; -0.0%; 0.0%\"),\"\")","v":"+101.7%"}]
[]
[null,{"$f":"ROUND(B52,-2)","v":{"v":11900,"d":"11,900"}},{"$f":"ROUND(C52,-2)","v":{"v":24000,"d":"24,000"}}]
[]
["Einsparrung über Lebensdauer","BEV ggu. Verbrenner"]
["Direkte Emissionen",{"$f":"C46-B46","v":{"v":13847.71388618197,"d":"13,848"}}]
["Total",{"$f":"SUM(C46:C51)-SUM(B46:B51)","v":{"v":12102.73048612475,"d":"12,103"}}]
{"$rows_empty":24}
[{"$nulls":3},{"$f":"_xlfn.FORMULATEXT(E24)","v":{"$error":"#N/A"}},{"$f":"_xlfn.FORMULATEXT(F24)","v":{"$error":"#N/A"}},{"$f":"_xlfn.FORMULATEXT(G24)","v":{"$error":"#N/A"}},{"$f":"_xlfn.FORMULATEXT(H24)","v":{"$error":"#N/A"}},{"$f":"_xlfn.FORMULATEXT(I23)","v":{"$error":"#N/A"}},{"$error":"#N/A"},{"$error":"#N/A"},{"$error":"#N/A"},{"$error":"#N/A"},{"$error":"#N/A"},{"$error":"#N/A"},{"$error":"#N/A"},{"$error":"#N/A"},{"$error":"#N/A"},{"$error":"#N/A"},null,{"$f":"_xlfn.FORMULATEXT(U24)","v":{"$error":"#N/A"}}]

{"sheet":"Annahmen (zur Information)","index":15,"n_rows":82,"n_cols":30,"rows_kept":82,"merged":[[3,5,3,8],[3,9,4,11],[3,17,3,28],[4,3,4,4],[5,2,8,2],[5,3,5,4],[5,9,5,11],[6,3,6,4],[7,3,7,4],[7,9,7,11],[8,3,8,4],[8,9,8,11],[9,2,10,2],[9,3,9,4],[9,9,9,11],[10,3,10,4],[13,5,13,8],[14,3,14,4],[15,2,19,2],[15,3,15,4],[15,9,15,11],[16,3,16,4],[17,3,17,4],[18,3,18,4],[19,3,19,4],[20,2,24,2],[20,3,20,4],[21,3,21,4],[22,3,22,4],[23,3,23,4],[24,3,24,4],[27,5,28,5],[27,6,27,11],[29,2,52,2],[29,3,52,3],[29,4,34,4],[35,4,40,4],[41,4,46,4],[47,4,52,4],[53,2,76,2],[53,3,76,3],[53,4,58,4],[59,4,64,4],[65,4,70,4],[71,4,76,4],[79,3,79,4],[80,3,80,4],[81,3,81,4]]}
[]
[null,null,"Fahrzeug",{"$nulls":13},"Ladeinfrastruktur"]
[]
[{"$nulls":5},"Fahrzeuggrösse",{"$nulls":3},"Quelle",{"$nulls":7},"Ladepunkt Leistung (kW)"]
[null,null,"Antrieb","Parameter",null,{"$f":"'2d. Annahmen'!B4","v":"Kleinwagen"},{"$f":"'2d. Annahmen'!B5","v":"Mittelklasse"},{"$f":"'2d. Annahmen'!B6","v":"Oberklasse"},{"$f":"'2d. Annahmen'!B7","v":"SUV"},{"$nulls":7},"Parameter",{"$f":"'2d. Annahmen'!A38","v":11},{"$f":"'2d. Annahmen'!A39","v":22},{"$f":"'2d. Annahmen'!A40","v":50},{"$f":"'2d. Annahmen'!A41","v":66},{"$f":"'2d. Annahmen'!A42","v":75},{"$f":"'2d. Annahmen'!A43","v":100},{"$f":"'2d. Annahmen'!A44","v":120},{"$f":"'2d. Annahmen'!A45","v":150},{"$f":"'2d. Annahmen'!A46","v":180},{"$f":"'2d. Annahmen'!A47","v":200},{"$f":"'2d. Annahmen'!A48","v":225},{"$f":"'2d. Annahmen'!A49","v":250},"Quelle"]
[null,null,"E-Fahrzeug","Batteriekapazität netto (kWh)",null,{"$f":"'2d. Annahmen'!F4","v":{"v":46.46,"d":"46.5"}},{"$f":"'2d. Annahmen'!F5","v":{"v":58.625,"d":"58.6"}},{"$f":"'2d. Annahmen'!F6","v":{"v":99.65,"d":"99.7"}},{"$f":"'2d. Annahmen'!F7","v":{"v":71.76,"d":"71.8"}},"Verbrauchskatalog (BFE)",{"$nulls":6},"Investitionskosten inkl. Installation (CHF/Ladepunkt)",{"$f":"ROUND('2d. Annahmen'!B38,-2)","v":{"v":1600,"d":"1,600"}},{"$f":"ROUND('2d. Annahmen'!B39,-2)","v":{"v":2000,"d":"2,000"}},{"$f":"ROUND('2d. Annahmen'!B40,-2)","v":{"v":23400,"d":"23,400"}},{"$f":"ROUND('2d. Annahmen'!B41,-2)","v":{"v":27500,"d":"27,500"}},{"$f":"ROUND('2d. Annahmen'!B42,-2)","v":{"v":29600,"d":"29,600"}},{"$f":"ROUND('2d. Annahmen'!B43,-2)","v":{"v":35400,"d":"35,400"}},{"$f":"ROUND('2d. Annahmen'!B44,-2)","v":{"v":39500,"d":"39,500"}},{"$f":"ROUND('2d. Annahmen'!B45,-2)","v":{"v":45200,"d":"45,200"}},{"$f":"ROUND('2d. Annahmen'!B46,-2)","v":{"v":50000,"d":"50,000"}},{"$f":"ROUND('2d. Annahmen'!B47,-2)","v":{"v":52800,"d":"52,800"}},{"$f":"ROUND('2d. Annahmen'!B48,-2)","v":{"v":55800,"d":"55,800"}},{"$f":"ROUND('2d. Annahmen'!B49,-2)","v":{"v":58300,"d":"58,300"}},"Praxiswerte/Annahme INFRAS"]
[{"$nulls":3},"Batteriekapazität nutzbar (kWh)",null,{"$f":"'2d. Annahmen'!G4","v":{"v":37.168,"d":"37.2"}},{"$f":"'2d. Annahmen'!G5","v":{"v":46.900000000000006,"d":"46.9"}},{"$f":"'2d. Annahmen'!G6","v":{"v":79.72000000000001,"d":"79.7"}},{"$f":"'2d. Annahmen'!G7","v":{"v":57.40800000000001,"d":"57.4"}},"Annahme INFRAS"]
[{"$nulls":3},"Verbrauch (kWh/100 km)",null,{"$f":"'2d. Annahmen'!H4","v":14.9},{"$f":"'2d. Annahmen'!H5","v":15.1},{"$f":"'2d. Annahmen'!H6","v":16.3},{"$f":"'2d. Annahmen'!H7","v":16.4},"Verbrauchskatalog (BFE)",{"$nulls":6},"Parameter","Wert","Quelle"]
[{"$nulls":3},"Lebensfahrleistung (km)",null,{"$f":"'2d. Annahmen'!I4","v":{"v":200000,"d":"200,000"}},{"$f":"'2d. Annahmen'!I5","v":{"v":200000,"d":"200,000"}},{"$f":"'2d. Annahmen'!I6","v":{"v":200000,"d":"200,000"}},{"$f":"'2d. Annahmen'!I7","v":{"v":200000,"d":"200,000"}},"Umweltrechner Verkehr (BFE)",{"$nulls":6},"Lebensdauer (Jahre)",{"$f":"'2d. Annahmen'!B54","v":10},"Ladeinfrastruktur in Mietobjekten (BFE)"]
[null,null,"Verbrenner","Verbrauch (l/100 km)",null,{"$f":"'2d. Annahmen'!F13","v":5.4},{"$f":"'2d. Annahmen'!F14","v":5.8},{"$f":"'2d. Annahmen'!F15","v":{"v":8,"d":"8.0"}},{"$f":"'2d. Annahmen'!F16","v":6.7},"Verbrauchskatalog (BFE)",{"$nulls":6},"Wirkungsgrad (Stromnetz > Fahrzeug)",{"$f":"'2d. Annahmen'!B56","v":{"v":0.9,"d":"90%"}},"Annahme INFRAS"]
[{"$nulls":3},"Lebensfahrleistung (km)",null,{"$f":"'2d. Annahmen'!G13","v":{"v":200000,"d":"200,000"}},{"$f":"'2d. Annahmen'!G14","v":{"v":200000,"d":"200,000"}},{"$f":"'2d. Annahmen'!G15","v":{"v":200000,"d":"200,000"}},{"$f":"'2d. Annahmen'!G16","v":{"v":200000,"d":"200,000"}},"Umweltrechner Verkehr (BFE)",{"$nulls":6},"Wirkungsgrad (Fahrzeug > Batterie)",{"$f":"'2d. Annahmen'!B57","v":{"v":0.95,"d":"95%"}},"Annahme INFRAS"]
[{"$nulls":16},"Unterhaltskosten (CHF/Jahr)",{"$f":"'2d. Annahmen'!B55","v":{"v":0.015,"d":"1.5%"}},"Ladeinfrastruktur in Mietobjekten (BFE)"]
[]
[{"$nulls":5},"Fahrzeuggrösse"]
[null,null,"Antrieb","Parameter",null,{"$f":"F5","v":"Kleinwagen"},{"$f":"G5","v":"Mittelklasse"},{"$f":"H5","v":"Oberklasse"},{"$f":"I5","v":"SUV"},"Quelle",{"$nulls":6},"Basisinfrastruktur"]
[null,null,"E-Fahrzeug","Anschaffungskosten exkl. Rabatt (CHF)",null,{"$f":"'2d. Annahmen'!K4","v":{"v":25801.2,"d":"25,801"}},{"$f":"'2d. Annahmen'!K5","v":{"v":32012.100000000002,"d":"32,012"}},{"$f":"'2d. Annahmen'!K6","v":{"v":75085.2,"d":"75,085"}},{"$f":"'2d. Annahmen'!K7","v":{"v":44609.4,"d":"44,609"}},"Gesamtkosten von Personenwagen (BFE)"]
[{"$nulls":3},"Reifen (CHF/Jahr)",null,{"$f":"'2d. Annahmen'!L4","v":350},{"$f":"'2d. Annahmen'!L5","v":470},{"$f":"'2d. Annahmen'!L6","v":750},{"$f":"'2d. Annahmen'!L7","v":590},"sffv",{"$nulls":6},"Parameter","Wert","Quelle"]
[{"$nulls":3},"Service und Reparatur (CHF/Jahr)",null,{"$f":"'2d. Annahmen'!M4","v":455},{"$f":"'2d. Annahmen'!M5","v":650},{"$f":"'2d. Annahmen'!M6","v":{"v":1000,"d":"1,000"}},{"$f":"'2d. Annahmen'!M7","v":850},"sffv",{"$nulls":6},"Lebensdauer (Jahre)",{"$f":"'2d. Annahmen'!B62","v":20},"Ladeinfrastruktur in Mietobjekten (BFE)"]
[{"$nulls":3},"Versicherung (CHF/Jahr)",null,{"$f":"'2d. Annahmen'!C22","v":900},{"$f":"'2d. Annahmen'!C23","v":{"v":1200,"d":"1,200"}},{"$f":"'2d. Annahmen'!C24","v":{"v":2000,"d":"2,000"}},{"$f":"'2d. Annahmen'!C25","v":{"v":1500,"d":"1,500"}},"sffv",{"$nulls":6},"Fixkosten Netzanschlusserhöhung (CHF)",{"$f":"'2d. Annahmen'!B60","v":{"v":50000,"d":"50,000"}},"Praxiswerte/Annahme INFRAS"]
[{"$nulls":3},"Flottenverwaltung (CHF/Jahr)",null,{"$f":"'2d. Annahmen'!D22","v":400},{"$f":"'2d. Annahmen'!D23","v":400},{"$f":"'2d. Annahmen'!D24","v":400},{"$f":"'2d. Annahmen'!D25","v":400},"sffv",{"$nulls":6},"Variable Kosten Netzanschlusserhöhung (CHF/kVA)",{"$f":"'2d. Annahmen'!B61","v":200},"Praxiswerte/Annahme INFRAS"]
[null,null,"Verbrenner","Anschaffungskosten exkl. Rabatt (CHF)",null,{"$f":"'2d. Annahmen'!H13","v":{"v":19204.05,"d":"19,204"}},{"$f":"'2d. Annahmen'!H14","v":{"v":32022.899999999998,"d":"32,023"}},{"$f":"'2d. Annahmen'!H15","v":{"v":73755.34999999999,"d":"73,755"}},{"$f":"'2d. Annahmen'!H16","v":{"v":37775.7,"d":"37,776"}},"Gesamtkosten von Personenwagen (BFE)",{"$nulls":6},"Fixkosten Ausbaustufe C1-C2, < 50 kW max. Ladeleistung (CHF)",{"$f":"'2d. Annahmen'!B65","v":{"v":2000,"d":"2,000"}},"Praxiswerte/Annahme INFRAS"]
[{"$nulls":3},"Reifen (CHF/Jahr)",null,{"$f":"'2d. Annahmen'!I13","v":300},{"$f":"'2d. Annahmen'!I14","v":400},{"$f":"'2d. Annahmen'!I15","v":650},{"$f":"'2d. Annahmen'!I16","v":500},"sffv",{"$nulls":6},"Fixkosten Ausbaustufe C1-C2, 50 - 150 kW max. Ladeleistung (CHF)",{"v":8500,"d":"8,500"},"Praxiswerte/Annahme INFRAS"]
[{"$nulls":3},"Service und Reparatur (CHF/Jahr)",null,{"$f":"'2d. Annahmen'!J13","v":700},{"$f":"'2d. Annahmen'!J14","v":{"v":1000,"d":"1,000"}},{"$f":"'2d. Annahmen'!J15","v":{"v":1500,"d":"1,500"}},{"$f":"'2d. Annahmen'!J16","v":{"v":1300,"d":"1,300"}},"sffv",{"$nulls":6},"Fixkosten Ausbaustufe C1-C2, > 150 kW max. Ladeleistung (CHF)",{"v":15000,"d":"15,000"},"Praxiswerte/Annahme INFRAS"]
[{"$nulls":3},"Versicherung (CHF/Jahr)",null,{"$f":"'2d. Annahmen'!C22","v":900},{"$f":"'2d. Annahmen'!C23","v":{"v":1200,"d":"1,200"}},{"$f":"'2d. Annahmen'!C24","v":{"v":2000,"d":"2,000"}},{"$f":"'2d. Annahmen'!C25","v":{"v":1500,"d":"1,500"}},"sffv",{"$nulls":6},"Variable Kosten Ausbaustufe C1-C2, AC Ladepunkt (CHF/Ladepunkt)",{"$f":"'2d. Annahmen'!B66","v":{"v":1000,"d":"1,000"}},"Praxiswerte/Annahme INFRAS"]
[{"$nulls":3},"Flottenverwaltung (CHF/Jahr)",null,{"$f":"'2d. Annahmen'!D22","v":400},{"$f":"'2d. Annahmen'!D23","v":400},{"$f":"'2d. Annahmen'!D24","v":400},{"$f":"'2d. Annahmen'!D25","v":400},"sffv",{"$nulls":6},"Variable Kosten Ausbaustufe C1-C2, DC Ladepunkt (CHF/Ladepunkt)",{"$f":"'2d. Annahmen'!C66","v":{"v":3000,"d":"3,000"}},"Praxiswerte/Annahme INFRAS"]
[]
[]
[{"$nulls":5},"Laufzeit (Monate)","Lebensfahrleistung (km)"]
[null,null,"Antrieb","Parameter","Fahrzeuggrösse",null,{"v":10000,"d":"10,000"},{"v":15000,"d":"15,000"},{"v":20000,"d":"20,000"},{"v":25000,"d":"25,000"},{"v":30000,"d":"30,000"},{"v":35000,"d":"35,000"},"Quelle"]
[null,null,{"$f":"C6","v":"E-Fahrzeug"},"Fahrzeug Restwert","Kleinwagen",12,{"$f":"G60*(1+'2d. Annahmen'!$N$4)","v":{"v":0.672425638888889,"d":"67%"}},{"$f":"H60*(1+'2d. Annahmen'!$N$4)","v":{"v":0.6617177777777778,"d":"66%"}},{"$f":"I60*(1+'2d. Annahmen'!$N$4)","v":{"v":0.6510099166666667,"d":"65%"}},{"$f":"J60*(1+'2d. Annahmen'!$N$4)","v":{"v":0.6387735277777777,"d":"64%"}},{"$f":"K60*(1+'2d. Annahmen'!$N$4)","v":{"v":0.6204175833333333,"d":"62%"}},{"$f":"L60*(1+'2d. Annahmen'!$N$4)","v":{"v":0.602061638888889,"d":"60%"}},"sffv"]
[{"$nulls":5},24,{"$f":"G61*(1+'2d. Annahmen'!$N$4)","v":{"v":0.6190700833333334,"d":"62%"}},{"$f":"H61*(1+'2d. Annahmen'!$N$4)","v":{"v":0.6001955555555556,"d":"60%"}},{"$f":"I61*(1+'2d. Annahmen'!$N$4)","v":{"v":0.5813210277777778,"d":"58%"}},{"$f":"J61*(1+'2d. Annahmen'!$N$4)","v":{"v":0.5597515,"d":"56%"}},{"$f":"K61*(1+'2d. Annahmen'!$N$4)","v":{"v":0.5273951666666667,"d":"53%"}},{"$f":"L61*(1+'2d. Annahmen'!$N$4)","v":{"v":0.49504019444444447,"d":"50%"}},"sffv"]
[{"$nulls":5},36,{"$f":"G62*(1+'2d. Annahmen'!$N$4)","v":{"v":0.5586,"d":"56%"}},{"$f":"H62*(1+'2d. Annahmen'!$N$4)","v":{"v":0.5341,"d":"53%"}},{"$f":"I62*(1+'2d. Annahmen'!$N$4)","v":{"v":0.5096,"d":"51%"}},{"$f":"J62*(1+'2d. Annahmen'!$N$4)","v":{"v":0.48160058333333333,"d":"48%"}},{"$f":"K62*(1+'2d. Annahmen'!$N$4)","v":{"v":0.4395994166666667,"d":"44%"}},{"$f":"L62*(1+'2d. Annahmen'!$N$4)","v":{"v":0.39759961111111114,"d":"40%"}},"sffv"]
[{"$nulls":5},48,{"$f":"G63*(1+'2d. Annahmen'!$N$4)","v":{"v":0.49101675,"d":"49%"}},{"$f":"H63*(1+'2d. Annahmen'!$N$4)","v":{"v":0.4634311111111111,"d":"46%"}},{"$f":"I63*(1+'2d. Annahmen'!$N$4)","v":{"v":0.43584547222222225,"d":"44%"}},{"$f":"J63*(1+'2d. Annahmen'!$N$4)","v":{"v":0.40431941666666665,"d":"40%"}},{"$f":"K63*(1+'2d. Annahmen'!$N$4)","v":{"v":0.35703169444444444,"d":"36%"}},{"$f":"L63*(1+'2d. Annahmen'!$N$4)","v":{"v":0.30974261111111107,"d":"31%"}},"sffv"]
[{"$nulls":5},60,{"$f":"G64*(1+'2d. Annahmen'!$N$4)","v":{"v":0.3928166666666667,"d":"39%"}},{"$f":"H64*(1+'2d. Annahmen'!$N$4)","v":{"v":0.366275,"d":"37%"}},{"$f":"I64*(1+'2d. Annahmen'!$N$4)","v":{"v":0.3397333333333334,"d":"34%"}},{"$f":"J64*(1+'2d. Annahmen'!$N$4)","v":{"v":0.3085829444444445,"d":"31%"}},{"$f":"K64*(1+'2d. Annahmen'!$N$4)","v":{"v":0.2639003888888889,"d":"26%"}},{"$f":"L64*(1+'2d. Annahmen'!$N$4)","v":{"v":0.21839980555555555,"d":"22%"}},"sffv"]
[{"$nulls":5},72,{"$f":"G65*(1+'2d. Annahmen'!$N$4)","v":{"v":0.27875555555555553,"d":"28%"}},{"$f":"H65*(1+'2d. Annahmen'!$N$4)","v":{"v":0.2569777777777778,"d":"26%"}},{"$f":"I65*(1+'2d. Annahmen'!$N$4)","v":{"v":0.2352,"d":"24%"}},{"$f":"J65*(1+'2d. Annahmen'!$N$4)","v":{"v":0.21031072222222225,"d":"21%"}},{"$f":"K65*(1+'2d. Annahmen'!$N$4)","v":{"v":0.17297816666666668,"d":"17%"}},{"$f":"L65*(1+'2d. Annahmen'!$N$4)","v":{"v":0.13564425000000002,"d":"14%"}},"sffv"]
[{"$nulls":4},"Mittelklasse",12,{"$f":"G60*(1+'2d. Annahmen'!$N$5)","v":{"v":0.6655641527777778,"d":"67%"}},{"$f":"H60*(1+'2d. Annahmen'!$N$5)","v":{"v":0.6549655555555556,"d":"65%"}},{"$f":"I60*(1+'2d. Annahmen'!$N$5)","v":{"v":0.6443669583333334,"d":"64%"}},{"$f":"J60*(1+'2d. Annahmen'!$N$5)","v":{"v":0.6322554305555556,"d":"63%"}},{"$f":"K60*(1+'2d. Annahmen'!$N$5)","v":{"v":0.6140867916666666,"d":"61%"}},{"$f":"L60*(1+'2d. Annahmen'!$N$5)","v":{"v":0.5959181527777778,"d":"60%"}},"sffv"]
[{"$nulls":5},24,{"$f":"G61*(1+'2d. Annahmen'!$N$5)","v":{"v":0.6127530416666667,"d":"61%"}},{"$f":"H61*(1+'2d. Annahmen'!$N$5)","v":{"v":0.5940711111111111,"d":"59%"}},{"$f":"I61*(1+'2d. Annahmen'!$N$5)","v":{"v":0.5753891805555557,"d":"58%"}},{"$f":"J61*(1+'2d. Annahmen'!$N$5)","v":{"v":0.5540397499999999,"d":"55%"}},{"$f":"K61*(1+'2d. Annahmen'!$N$5)","v":{"v":0.5220135833333334,"d":"52%"}},{"$f":"L61*(1+'2d. Annahmen'!$N$5)","v":{"v":0.4899887638888889,"d":"49%"}},"sffv"]
[{"$nulls":5},36,{"$f":"G62*(1+'2d. Annahmen'!$N$5)","v":{"v":0.5529,"d":"55%"}},{"$f":"H62*(1+'2d. Annahmen'!$N$5)","v":{"v":0.5286500000000001,"d":"53%"}},{"$f":"I62*(1+'2d. Annahmen'!$N$5)","v":{"v":0.5044,"d":"50%"}},{"$f":"J62*(1+'2d. Annahmen'!$N$5)","v":{"v":0.4766862916666667,"d":"48%"}},{"$f":"K62*(1+'2d. Annahmen'!$N$5)","v":{"v":0.43511370833333335,"d":"44%"}},{"$f":"L62*(1+'2d. Annahmen'!$N$5)","v":{"v":0.3935424722222223,"d":"39%"}},"sffv"]
[{"$nulls":5},48,{"$f":"G63*(1+'2d. Annahmen'!$N$5)","v":{"v":0.486006375,"d":"49%"}},{"$f":"H63*(1+'2d. Annahmen'!$N$5)","v":{"v":0.45870222222222223,"d":"46%"}},{"$f":"I63*(1+'2d. Annahmen'!$N$5)","v":{"v":0.4313980694444445,"d":"43%"}},{"$f":"J63*(1+'2d. Annahmen'!$N$5)","v":{"v":0.40019370833333334,"d":"40%"}},{"$f":"K63*(1+'2d. Annahmen'!$N$5)","v":{"v":0.3533885138888889,"d":"35%"}},{"$f":"L63*(1+'2d. Annahmen'!$N$5)","v":{"v":0.30658197222222217,"d":"31%"}},"sffv"]
[{"$nulls":5},60,{"$f":"G64*(1+'2d. Annahmen'!$N$5)","v":{"v":0.38880833333333337,"d":"39%"}},{"$f":"H64*(1+'2d. Annahmen'!$N$5)","v":{"v":0.3625375,"d":"36%"}},{"$f":"I64*(1+'2d. Annahmen'!$N$5)","v":{"v":0.3362666666666667,"d":"34%"}},{"$f":"J64*(1+'2d. Annahmen'!$N$5)","v":{"v":0.30543413888888893,"d":"31%"}},{"$f":"K64*(1+'2d. Annahmen'!$N$5)","v":{"v":0.2612075277777778,"d":"26%"}},{"$f":"L64*(1+'2d. Annahmen'!$N$5)","v":{"v":0.2161712361111111,"d":"22%"}},"sffv"]
[{"$nulls":5},72,{"$f":"G65*(1+'2d. Annahmen'!$N$5)","v":{"v":0.2759111111111111,"d":"28%"}},{"$f":"H65*(1+'2d. Annahmen'!$N$5)","v":{"v":0.25435555555555556,"d":"25%"}},{"$f":"I65*(1+'2d. Annahmen'!$N$5)","v":{"v":0.23279999999999998,"d":"23%"}},{"$f":"J65*(1+'2d. Annahmen'!$N$5)","v":{"v":0.20816469444444446,"d":"21%"}},{"$f":"K65*(1+'2d. Annahmen'!$N$5)","v":{"v":0.17121308333333335,"d":"17%"}},{"$f":"L65*(1+'2d. Annahmen'!$N$5)","v":{"v":0.134260125,"d":"13%"}},"sffv"]
[{"$nulls":4},"Oberklasse",12,{"$f":"G60*(1+'2d. Annahmen'!$N$6)","v":{"v":0.6587026666666667,"d":"66%"}},{"$f":"H60*(1+'2d. Annahmen'!$N$6)","v":{"v":0.6482133333333334,"d":"65%"}},{"$f":"I60*(1+'2d. Annahmen'!$N$6)","v":{"v":0.6377240000000001,"d":"64%"}},{"$f":"J60*(1+'2d. Annahmen'!$N$6)","v":{"v":0.6257373333333333,"d":"63%"}},{"$f":"K60*(1+'2d. Annahmen'!$N$6)","v":{"v":0.607756,"d":"61%"}},{"$f":"L60*(1+'2d. Annahmen'!$N$6)","v":{"v":0.5897746666666667,"d":"59%"}},"sffv"]
[{"$nulls":5},24,{"$f":"G61*(1+'2d. Annahmen'!$N$6)","v":{"v":0.6064360000000001,"d":"61%"}},{"$f":"H61*(1+'2d. Annahmen'!$N$6)","v":{"v":0.5879466666666666,"d":"59%"}},{"$f":"I61*(1+'2d. Annahmen'!$N$6)","v":{"v":0.5694573333333334,"d":"57%"}},{"$f":"J61*(1+'2d. Annahmen'!$N$6)","v":{"v":0.5483279999999999,"d":"55%"}},{"$f":"K61*(1+'2d. Annahmen'!$N$6)","v":{"v":0.5166320000000001,"d":"52%"}},{"$f":"L61*(1+'2d. Annahmen'!$N$6)","v":{"v":0.4849373333333334,"d":"48%"}},"sffv"]
[{"$nulls":5},36,{"$f":"G62*(1+'2d. Annahmen'!$N$6)","v":{"v":0.5471999999999999,"d":"55%"}},{"$f":"H62*(1+'2d. Annahmen'!$N$6)","v":{"v":0.5232,"d":"52%"}},{"$f":"I62*(1+'2d. Annahmen'!$N$6)","v":{"v":0.4992,"d":"50%"}},{"$f":"J62*(1+'2d. Annahmen'!$N$6)","v":{"v":0.471772,"d":"47%"}},{"$f":"K62*(1+'2d. Annahmen'!$N$6)","v":{"v":0.430628,"d":"43%"}},{"$f":"L62*(1+'2d. Annahmen'!$N$6)","v":{"v":0.38948533333333335,"d":"39%"}},"sffv"]
[{"$nulls":5},48,{"$f":"G63*(1+'2d. Annahmen'!$N$6)","v":{"v":0.480996,"d":"48%"}},{"$f":"H63*(1+'2d. Annahmen'!$N$6)","v":{"v":0.45397333333333334,"d":"45%"}},{"$f":"I63*(1+'2d. Annahmen'!$N$6)","v":{"v":0.4269506666666667,"d":"43%"}},{"$f":"J63*(1+'2d. Annahmen'!$N$6)","v":{"v":0.396068,"d":"40%"}},{"$f":"K63*(1+'2d. Annahmen'!$N$6)","v":{"v":0.34974533333333335,"d":"35%"}},{"$f":"L63*(1+'2d. Annahmen'!$N$6)","v":{"v":0.3034213333333333,"d":"30%"}},"sffv"]
[{"$nulls":5},60,{"$f":"G64*(1+'2d. Annahmen'!$N$6)","v":{"v":0.38480000000000003,"d":"38%"}},{"$f":"H64*(1+'2d. Annahmen'!$N$6)","v":{"v":0.3588,"d":"36%"}},{"$f":"I64*(1+'2d. Annahmen'!$N$6)","v":{"v":0.33280000000000004,"d":"33%"}},{"$f":"J64*(1+'2d. Annahmen'!$N$6)","v":{"v":0.30228533333333335,"d":"30%"}},{"$f":"K64*(1+'2d. Annahmen'!$N$6)","v":{"v":0.25851466666666667,"d":"26%"}},{"$f":"L64*(1+'2d. Annahmen'!$N$6)","v":{"v":0.21394266666666667,"d":"21%"}},"sffv"]
[{"$nulls":5},72,{"$f":"G65*(1+'2d. Annahmen'!$N$6)","v":{"v":0.2730666666666667,"d":"27%"}},{"$f":"H65*(1+'2d. Annahmen'!$N$6)","v":{"v":0.25173333333333336,"d":"25%"}},{"$f":"I65*(1+'2d. Annahmen'!$N$6)","v":{"v":0.2304,"d":"23%"}},{"$f":"J65*(1+'2d. Annahmen'!$N$6)","v":{"v":0.20601866666666668,"d":"21%"}},{"$f":"K65*(1+'2d. Annahmen'!$N$6)","v":{"v":0.16944800000000002,"d":"17%"}},{"$f":"L65*(1+'2d. Annahmen'!$N$6)","v":{"v":0.13287600000000002,"d":"13%"}},"sffv"]
[{"$nulls":4},"SUV",12,{"$f":"G60*(1+'2d. Annahmen'!$N$7)","v":{"v":0.6621334097222222,"d":"66%"}},{"$f":"H60*(1+'2d. Annahmen'!$N$7)","v":{"v":0.6515894444444444,"d":"65%"}},{"$f":"I60*(1+'2d. Annahmen'!$N$7)","v":{"v":0.6410454791666668,"d":"64%"}},{"$f":"J60*(1+'2d. Annahmen'!$N$7)","v":{"v":0.6289963819444444,"d":"63%"}},{"$f":"K60*(1+'2d. Annahmen'!$N$7)","v":{"v":0.6109213958333333,"d":"61%"}},{"$f":"L60*(1+'2d. Annahmen'!$N$7)","v":{"v":0.5928464097222222,"d":"59%"}},"sffv"]
[{"$nulls":5},24,{"$f":"G61*(1+'2d. Annahmen'!$N$7)","v":{"v":0.6095945208333334,"d":"61%"}},{"$f":"H61*(1+'2d. Annahmen'!$N$7)","v":{"v":0.5910088888888889,"d":"59%"}},{"$f":"I61*(1+'2d. Annahmen'!$N$7)","v":{"v":0.5724232569444445,"d":"57%"}},{"$f":"J61*(1+'2d. Annahmen'!$N$7)","v":{"v":0.551183875,"d":"55%"}},{"$f":"K61*(1+'2d. Annahmen'!$N$7)","v":{"v":0.5193227916666667,"d":"52%"}},{"$f":"L61*(1+'2d. Annahmen'!$N$7)","v":{"v":0.48746304861111117,"d":"49%"}},"sffv"]
[{"$nulls":5},36,{"$f":"G62*(1+'2d. Annahmen'!$N$7)","v":{"v":0.5500499999999999,"d":"55%"}},{"$f":"H62*(1+'2d. Annahmen'!$N$7)","v":{"v":0.525925,"d":"53%"}},{"$f":"I62*(1+'2d. Annahmen'!$N$7)","v":{"v":0.5018,"d":"50%"}},{"$f":"J62*(1+'2d. Annahmen'!$N$7)","v":{"v":0.47422914583333337,"d":"47%"}},{"$f":"K62*(1+'2d. Annahmen'!$N$7)","v":{"v":0.4328708541666667,"d":"43%"}},{"$f":"L62*(1+'2d. Annahmen'!$N$7)","v":{"v":0.3915139027777778,"d":"39%"}},"sffv"]
[{"$nulls":5},48,{"$f":"G63*(1+'2d. Annahmen'!$N$7)","v":{"v":0.4835011875,"d":"48%"}},{"$f":"H63*(1+'2d. Annahmen'!$N$7)","v":{"v":0.4563377777777778,"d":"46%"}},{"$f":"I63*(1+'2d. Annahmen'!$N$7)","v":{"v":0.4291743680555556,"d":"43%"}},{"$f":"J63*(1+'2d. Annahmen'!$N$7)","v":{"v":0.39813085416666666,"d":"40%"}},{"$f":"K63*(1+'2d. Annahmen'!$N$7)","v":{"v":0.35156692361111114,"d":"35%"}},{"$f":"L63*(1+'2d. Annahmen'!$N$7)","v":{"v":0.30500165277777774,"d":"31%"}},"sffv"]
[{"$nulls":5},60,{"$f":"G64*(1+'2d. Annahmen'!$N$7)","v":{"v":0.38680416666666667,"d":"39%"}},{"$f":"H64*(1+'2d. Annahmen'!$N$7)","v":{"v":0.36066875000000004,"d":"36%"}},{"$f":"I64*(1+'2d. Annahmen'!$N$7)","v":{"v":0.3345333333333334,"d":"33%"}},{"$f":"J64*(1+'2d. Annahmen'!$N$7)","v":{"v":0.30385973611111117,"d":"30%"}},{"$f":"K64*(1+'2d. Annahmen'!$N$7)","v":{"v":0.2598610972222222,"d":"26%"}},{"$f":"L64*(1+'2d. Annahmen'!$N$7)","v":{"v":0.2150569513888889,"d":"22%"}},"sffv"]
[{"$nulls":5},72,{"$f":"G65*(1+'2d. Annahmen'!$N$7)","v":{"v":0.2744888888888889,"d":"27%"}},{"$f":"H65*(1+'2d. Annahmen'!$N$7)","v":{"v":0.25304444444444446,"d":"25%"}},{"$f":"I65*(1+'2d. Annahmen'!$N$7)","v":{"v":0.23159999999999997,"d":"23%"}},{"$f":"J65*(1+'2d. Annahmen'!$N$7)","v":{"v":0.20709168055555557,"d":"21%"}},{"$f":"K65*(1+'2d. Annahmen'!$N$7)","v":{"v":0.17033054166666667,"d":"17%"}},{"$f":"L65*(1+'2d. Annahmen'!$N$7)","v":{"v":0.13356806250000003,"d":"13%"}},"sffv"]
[null,null,"Verbrenner","Fahrzeug Restwert","Kleinwagen",12,{"$f":"G60*(1+'2d. Annahmen'!$K$13)","v":{"v":0.6964408402777778,"d":"70%"}},{"$f":"H60*(1+'2d. Annahmen'!$K$13)","v":{"v":0.6853505555555556,"d":"69%"}},{"$f":"I60*(1+'2d. Annahmen'!$K$13)","v":{"v":0.6742602708333334,"d":"67%"}},{"$f":"J60*(1+'2d. Annahmen'!$K$13)","v":{"v":0.6615868680555554,"d":"66%"}},{"$f":"K60*(1+'2d. Annahmen'!$K$13)","v":{"v":0.6425753541666666,"d":"64%"}},{"$f":"L60*(1+'2d. Annahmen'!$K$13)","v":{"v":0.6235638402777778,"d":"62%"}},"sffv"]
[{"$nulls":5},24,{"$f":"G61*(1+'2d. Annahmen'!$K$13)","v":{"v":0.6411797291666667,"d":"64%"}},{"$f":"H61*(1+'2d. Annahmen'!$K$13)","v":{"v":0.621631111111111,"d":"62%"}},{"$f":"I61*(1+'2d. Annahmen'!$K$13)","v":{"v":0.6020824930555556,"d":"60%"}},{"$f":"J61*(1+'2d. Annahmen'!$K$13)","v":{"v":0.579742625,"d":"58%"}},{"$f":"K61*(1+'2d. Annahmen'!$K$13)","v":{"v":0.5462307083333333,"d":"55%"}},{"$f":"L61*(1+'2d. Annahmen'!$K$13)","v":{"v":0.5127202013888889,"d":"51%"}},"sffv"]
[{"$nulls":5},36,{"$f":"G62*(1+'2d. Annahmen'!$K$13)","v":{"v":0.5785499999999999,"d":"58%"}},{"$f":"H62*(1+'2d. Annahmen'!$K$13)","v":{"v":0.553175,"d":"55%"}},{"$f":"I62*(1+'2d. Annahmen'!$K$13)","v":{"v":0.5277999999999999,"d":"53%"}},{"$f":"J62*(1+'2d. Annahmen'!$K$13)","v":{"v":0.49880060416666666,"d":"50%"}},{"$f":"K62*(1+'2d. Annahmen'!$K$13)","v":{"v":0.45529939583333334,"d":"46%"}},{"$f":"L62*(1+'2d. Annahmen'!$K$13)","v":{"v":0.4117995972222222,"d":"41%"}},"sffv"]
[{"$nulls":5},48,{"$f":"G63*(1+'2d. Annahmen'!$K$13)","v":{"v":0.5085530625,"d":"51%"}},{"$f":"H63*(1+'2d. Annahmen'!$K$13)","v":{"v":0.4799822222222222,"d":"48%"}},{"$f":"I63*(1+'2d. Annahmen'!$K$13)","v":{"v":0.4514113819444444,"d":"45%"}},{"$f":"J63*(1+'2d. Annahmen'!$K$13)","v":{"v":0.41875939583333327,"d":"42%"}},{"$f":"K63*(1+'2d. Annahmen'!$K$13)","v":{"v":0.3697828263888889,"d":"37%"}},{"$f":"L63*(1+'2d. Annahmen'!$K$13)","v":{"v":0.3208048472222222,"d":"32%"}},"sffv"]
[{"$nulls":5},60,{"$f":"G64*(1+'2d. Annahmen'!$K$13)","v":{"v":0.40684583333333335,"d":"41%"}},{"$f":"H64*(1+'2d. Annahmen'!$K$13)","v":{"v":0.37935625,"d":"38%"}},{"$f":"I64*(1+'2d. Annahmen'!$K$13)","v":{"v":0.3518666666666667,"d":"35%"}},{"$f":"J64*(1+'2d. Annahmen'!$K$13)","v":{"v":0.3196037638888889,"d":"32%"}},{"$f":"K64*(1+'2d. Annahmen'!$K$13)","v":{"v":0.2733254027777778,"d":"27%"}},{"$f":"L64*(1+'2d. Annahmen'!$K$13)","v":{"v":0.2261997986111111,"d":"23%"}},"sffv"]
[{"$nulls":5},72,{"$f":"G65*(1+'2d. Annahmen'!$K$13)","v":{"v":0.2887111111111111,"d":"29%"}},{"$f":"H65*(1+'2d. Annahmen'!$K$13)","v":{"v":0.26615555555555553,"d":"27%"}},{"$f":"I65*(1+'2d. Annahmen'!$K$13)","v":{"v":0.24359999999999996,"d":"24%"}},{"$f":"J65*(1+'2d. Annahmen'!$K$13)","v":{"v":0.21782181944444445,"d":"22%"}},{"$f":"K65*(1+'2d. Annahmen'!$K$13)","v":{"v":0.17915595833333334,"d":"18%"}},{"$f":"L65*(1+'2d. Annahmen'!$K$13)","v":{"v":0.14048868750000001,"d":"14%"}},"sffv"]
[{"$nulls":4},"Mittelklasse",12,{"$f":"'2d. Annahmen'!B77","v":{"v":0.6861486111111111,"d":"69%"}},{"$f":"'2d. Annahmen'!C77","v":{"v":0.6752222222222223,"d":"68%"}},{"$f":"'2d. Annahmen'!D77","v":{"v":0.6642958333333334,"d":"66%"}},{"$f":"'2d. Annahmen'!E77","v":{"v":0.6518097222222222,"d":"65%"}},{"$f":"'2d. Annahmen'!F77","v":{"v":0.6330791666666666,"d":"63%"}},{"$f":"'2d. Annahmen'!G77","v":{"v":0.6143486111111112,"d":"61%"}},"sffv"]
[{"$nulls":5},24,{"$f":"'2d. Annahmen'!B78","v":{"v":0.6317041666666667,"d":"63%"}},{"$f":"'2d. Annahmen'!C78","v":{"v":0.6124444444444445,"d":"61%"}},{"$f":"'2d. Annahmen'!D78","v":{"v":0.5931847222222223,"d":"59%"}},{"$f":"'2d. Annahmen'!E78","v":{"v":0.571175,"d":"57%"}},{"$f":"'2d. Annahmen'!F78","v":{"v":0.5381583333333334,"d":"54%"}},{"$f":"'2d. Annahmen'!G78","v":{"v":0.5051430555555556,"d":"51%"}},"sffv"]
[{"$nulls":5},36,{"$f":"'2d. Annahmen'!B79","v":{"v":0.57,"d":"57%"}},{"$f":"'2d. Annahmen'!C79","v":{"v":0.545,"d":"55%"}},{"$f":"'2d. Annahmen'!D79","v":{"v":0.52,"d":"52%"}},{"$f":"'2d. Annahmen'!E79","v":{"v":0.4914291666666667,"d":"49%"}},{"$f":"'2d. Annahmen'!F79","v":{"v":0.44857083333333336,"d":"45%"}},{"$f":"'2d. Annahmen'!G79","v":{"v":0.40571388888888893,"d":"41%"}},"sffv"]
[{"$nulls":5},48,{"$f":"'2d. Annahmen'!B80","v":{"v":0.5010375,"d":"50%"}},{"$f":"'2d. Annahmen'!C80","v":{"v":0.4728888888888889,"d":"47%"}},{"$f":"'2d. Annahmen'!D80","v":{"v":0.4447402777777778,"d":"44%"}},{"$f":"'2d. Annahmen'!E80","v":{"v":0.41257083333333333,"d":"41%"}},{"$f":"'2d. Annahmen'!F80","v":{"v":0.3643180555555556,"d":"36%"}},{"$f":"'2d. Annahmen'!G80","v":{"v":0.31606388888888887,"d":"32%"}},"sffv"]
[{"$nulls":5},60,{"$f":"'2d. Annahmen'!B81","v":{"v":0.4008333333333334,"d":"40%"}},{"$f":"'2d. Annahmen'!C81","v":{"v":0.37375,"d":"37%"}},{"$f":"'2d. Annahmen'!D81","v":{"v":0.34666666666666673,"d":"35%"}},{"$f":"'2d. Annahmen'!E81","v":{"v":0.3148805555555556,"d":"31%"}},{"$f":"'2d. Annahmen'!F81","v":{"v":0.2692861111111111,"d":"27%"}},{"$f":"'2d. Annahmen'!G81","v":{"v":0.22285694444444445,"d":"22%"}},"sffv"]
[{"$nulls":5},72,{"$f":"'2d. Annahmen'!B82","v":{"v":0.28444444444444444,"d":"28%"}},{"$f":"'2d. Annahmen'!C82","v":{"v":0.26222222222222225,"d":"26%"}},{"$f":"'2d. Annahmen'!D82","v":{"v":0.24,"d":"24%"}},{"$f":"'2d. Annahmen'!E82","v":{"v":0.2146027777777778,"d":"21%"}},{"$f":"'2d. Annahmen'!F82","v":{"v":0.17650833333333335,"d":"18%"}},{"$f":"'2d. Annahmen'!G82","v":{"v":0.13841250000000002,"d":"14%"}},"sffv"]
[{"$nulls":4},"Oberklasse",12,{"$f":"G60*(1+'2d. Annahmen'!$K$15)","v":{"v":0.672425638888889,"d":"67%"}},{"$f":"H60*(1+'2d. Annahmen'!$K$15)","v":{"v":0.6617177777777778,"d":"66%"}},{"$f":"I60*(1+'2d. Annahmen'!$K$15)","v":{"v":0.6510099166666667,"d":"65%"}},{"$f":"J60*(1+'2d. Annahmen'!$K$15)","v":{"v":0.6387735277777777,"d":"64%"}},{"$f":"K60*(1+'2d. Annahmen'!$K$15)","v":{"v":0.6204175833333333,"d":"62%"}},{"$f":"L60*(1+'2d. Annahmen'!$K$15)","v":{"v":0.602061638888889,"d":"60%"}},"sffv"]
[{"$nulls":5},24,{"$f":"G61*(1+'2d. Annahmen'!$K$15)","v":{"v":0.6190700833333334,"d":"62%"}},{"$f":"H61*(1+'2d. Annahmen'!$K$15)","v":{"v":0.6001955555555556,"d":"60%"}},{"$f":"I61*(1+'2d. Annahmen'!$K$15)","v":{"v":0.5813210277777778,"d":"58%"}},{"$f":"J61*(1+'2d. Annahmen'!$K$15)","v":{"v":0.5597515,"d":"56%"}},{"$f":"K61*(1+'2d. Annahmen'!$K$15)","v":{"v":0.5273951666666667,"d":"53%"}},{"$f":"L61*(1+'2d. Annahmen'!$K$15)","v":{"v":0.49504019444444447,"d":"50%"}},"sffv"]
[{"$nulls":5},36,{"$f":"G62*(1+'2d. Annahmen'!$K$15)","v":{"v":0.5586,"d":"56%"}},{"$f":"H62*(1+'2d. Annahmen'!$K$15)","v":{"v":0.5341,"d":"53%"}},{"$f":"I62*(1+'2d. Annahmen'!$K$15)","v":{"v":0.5096,"d":"51%"}},{"$f":"J62*(1+'2d. Annahmen'!$K$15)","v":{"v":0.48160058333333333,"d":"48%"}},{"$f":"K62*(1+'2d. Annahmen'!$K$15)","v":{"v":0.4395994166666667,"d":"44%"}},{"$f":"L62*(1+'2d. Annahmen'!$K$15)","v":{"v":0.39759961111111114,"d":"40%"}},"sffv"]
[{"$nulls":5},48,{"$f":"G63*(1+'2d. Annahmen'!$K$15)","v":{"v":0.49101675,"d":"49%"}},{"$f":"H63*(1+'2d. Annahmen'!$K$15)","v":{"v":0.4634311111111111,"d":"46%"}},{"$f":"I63*(1+'2d. Annahmen'!$K$15)","v":{"v":0.43584547222222225,"d":"44%"}},{"$f":"J63*(1+'2d. Annahmen'!$K$15)","v":{"v":0.40431941666666665,"d":"40%"}},{"$f":"K63*(1+'2d. Annahmen'!$K$15)","v":{"v":0.35703169444444444,"d":"36%"}},{"$f":"L63*(1+'2d. Annahmen'!$K$15)","v":{"v":0.30974261111111107,"d":"31%"}},"sffv"]
[{"$nulls":5},60,{"$f":"G64*(1+'2d. Annahmen'!$K$15)","v":{"v":0.3928166666666667,"d":"39%"}},{"$f":"H64*(1+'2d. Annahmen'!$K$15)","v":{"v":0.366275,"d":"37%"}},{"$f":"I64*(1+'2d. Annahmen'!$K$15)","v":{"v":0.3397333333333334,"d":"34%"}},{"$f":"J64*(1+'2d. Annahmen'!$K$15)","v":{"v":0.3085829444444445,"d":"31%"}},{"$f":"K64*(1+'2d. Annahmen'!$K$15)","v":{"v":0.2639003888888889,"d":"26%"}},{"$f":"L64*(1+'2d. Annahmen'!$K$15)","v":{"v":0.21839980555555555,"d":"22%"}},"sffv"]
[{"$nulls":5},72,{"$f":"G65*(1+'2d. Annahmen'!$K$15)","v":{"v":0.27875555555555553,"d":"28%"}},{"$f":"H65*(1+'2d. Annahmen'!$K$15)","v":{"v":0.2569777777777778,"d":"26%"}},{"$f":"I65*(1+'2d. Annahmen'!$K$15)","v":{"v":0.2352,"d":"24%"}},{"$f":"J65*(1+'2d. Annahmen'!$K$15)","v":{"v":0.21031072222222225,"d":"21%"}},{"$f":"K65*(1+'2d. Annahmen'!$K$15)","v":{"v":0.17297816666666668,"d":"17%"}},{"$f":"L65*(1+'2d. Annahmen'!$K$15)","v":{"v":0.13564425000000002,"d":"14%"}},"sffv"]
[{"$nulls":4},"SUV",12,{"$f":"G60*(1+'2d. Annahmen'!$K$16)","v":{"v":0.679287125,"d":"68%"}},{"$f":"H60*(1+'2d. Annahmen'!$K$16)","v":{"v":0.66847,"d":"67%"}},{"$f":"I60*(1+'2d. Annahmen'!$K$16)","v":{"v":0.657652875,"d":"66%"}},{"$f":"J60*(1+'2d. Annahmen'!$K$16)","v":{"v":0.645291625,"d":"65%"}},{"$f":"K60*(1+'2d. Annahmen'!$K$16)","v":{"v":0.6267483749999999,"d":"63%"}},{"$f":"L60*(1+'2d. Annahmen'!$K$16)","v":{"v":0.608205125,"d":"61%"}},"sffv"]
[{"$nulls":5},24,{"$f":"G61*(1+'2d. Annahmen'!$K$16)","v":{"v":0.625387125,"d":"63%"}},{"$f":"H61*(1+'2d. Annahmen'!$K$16)","v":{"v":0.60632,"d":"61%"}},{"$f":"I61*(1+'2d. Annahmen'!$K$16)","v":{"v":0.5872528750000001,"d":"59%"}},{"$f":"J61*(1+'2d. Annahmen'!$K$16)","v":{"v":0.56546325,"d":"57%"}},{"$f":"K61*(1+'2d. Annahmen'!$K$16)","v":{"v":0.53277675,"d":"53%"}},{"$f":"L61*(1+'2d. Annahmen'!$K$16)","v":{"v":0.500091625,"d":"50%"}},"sffv"]
[{"$nulls":5},36,{"$f":"G62*(1+'2d. Annahmen'!$K$16)","v":{"v":0.5642999999999999,"d":"56%"}},{"$f":"H62*(1+'2d. Annahmen'!$K$16)","v":{"v":0.5395500000000001,"d":"54%"}},{"$f":"I62*(1+'2d. Annahmen'!$K$16)","v":{"v":0.5148,"d":"51%"}},{"$f":"J62*(1+'2d. Annahmen'!$K$16)","v":{"v":0.486514875,"d":"49%"}},{"$f":"K62*(1+'2d. Annahmen'!$K$16)","v":{"v":0.444085125,"d":"44%"}},{"$f":"L62*(1+'2d. Annahmen'!$K$16)","v":{"v":0.40165675000000006,"d":"40%"}},"sffv"]
[{"$nulls":5},48,{"$f":"G63*(1+'2d. Annahmen'!$K$16)","v":{"v":0.496027125,"d":"50%"}},{"$f":"H63*(1+'2d. Annahmen'!$K$16)","v":{"v":0.46816,"d":"47%"}},{"$f":"I63*(1+'2d. Annahmen'!$K$16)","v":{"v":0.44029287500000003,"d":"44%"}},{"$f":"J63*(1+'2d. Annahmen'!$K$16)","v":{"v":0.408445125,"d":"41%"}},{"$f":"K63*(1+'2d. Annahmen'!$K$16)","v":{"v":0.360674875,"d":"36%"}},{"$f":"L63*(1+'2d. Annahmen'!$K$16)","v":{"v":0.31290324999999997,"d":"31%"}},"sffv"]
[{"$nulls":5},60,{"$f":"G64*(1+'2d. Annahmen'!$K$16)","v":{"v":0.39682500000000004,"d":"40%"}},{"$f":"H64*(1+'2d. Annahmen'!$K$16)","v":{"v":0.3700125,"d":"37%"}},{"$f":"I64*(1+'2d. Annahmen'!$K$16)","v":{"v":0.34320000000000006,"d":"34%"}},{"$f":"J64*(1+'2d. Annahmen'!$K$16)","v":{"v":0.31173175000000003,"d":"31%"}},{"$f":"K64*(1+'2d. Annahmen'!$K$16)","v":{"v":0.26659325,"d":"27%"}},{"$f":"L64*(1+'2d. Annahmen'!$K$16)","v":{"v":0.22062837500000002,"d":"22%"}},"sffv"]
[{"$nulls":5},72,{"$f":"G65*(1+'2d. Annahmen'!$K$16)","v":{"v":0.2816,"d":"28%"}},{"$f":"H65*(1+'2d. Annahmen'!$K$16)","v":{"v":0.2596,"d":"26%"}},{"$f":"I65*(1+'2d. Annahmen'!$K$16)","v":{"v":0.23759999999999998,"d":"24%"}},{"$f":"J65*(1+'2d. Annahmen'!$K$16)","v":{"v":0.21245675000000003,"d":"21%"}},{"$f":"K65*(1+'2d. Annahmen'!$K$16)","v":{"v":0.17474325000000002,"d":"17%"}},{"$f":"L65*(1+'2d. Annahmen'!$K$16)","v":{"v":0.137028375,"d":"14%"}},"sffv"]
[]
[]
[null,null,"Antrieb","Parameter",null,"Wert","Quelle"]
[null,null,"E-Fahrzeug","Flottenrabatt bei Anschaffung",null,{"$f":"'2d. Annahmen'!B29","v":{"v":0.1,"d":"10%"}},"sffv"]
[null,null,"Verbrenner","Flottenrabatt bei Anschaffung",null,{"$f":"'2d. Annahmen'!B30","v":{"v":0.15,"d":"15%"}},"sffv"]